{"text_format":"1","workbook":"xlsx","n_sheets":8,"sheets":["VALORES_ZA","VALORES_TE","VALORES_HU","NORMAS","MANEJO DE LAS TABLAS","HUESCA 2025","ZARAGOZA 2025","TERUEL 2025"],"not_rendered":{"charts":0,"images":0,"macros":1,"external_links":0,"defined_names":6,"comments":0,"pivot_tables":0},"unopened":[],"bounds":{"document_bytes":16777216,"sheet_cells":100000,"rows_first":2000,"rows_last":500,"rows_between":2000,"halvings":0,"cell_chars":16384,"cell_head_chars":4096},"cells_cut":0,"cells_raw":0,"read":"whole","date_system":"1900"}

{"sheet":"VALORES_ZA","index":0,"n_rows":294,"n_cols":21,"rows_kept":294,"cut":false,"hidden":true,"merged":[]}
["COD. PROVINCIA","PROVINCIA","Cod PROV+MUN","Orden","MUNICIPIO","AM-F","C","O","V","PD","CR","FR","AR","OR","VR","FE","EP","MB-MT","MM","RI"]
[50,"ZARAGOZA",50001,1,"ABANTO",null,null,null,null,null,null,null,null,null,null,null,null,null,1000,750,1]
[50,"ZARAGOZA",50002,2,"ACERED",null,null,null,null,null,null,null,null,null,null,null,null,null,1000,750]
[50,"ZARAGOZA",50003,3,"AGÓN",null,null,null,null,2500,null,null,null,null,null,null,null,null,750,500]
[50,"ZARAGOZA",50004,4,"AGUARÓN",null,null,null,null,null,null,null,null,null,null,null,null,null,1000,600]
[50,"ZARAGOZA",50005,5,"AGUILÓN",null,null,null,null,null,null,null,null,null,null,null,null,null,1000,750]
[50,"ZARAGOZA",50006,6,"AINZÓN",null,null,null,null,null,null,null,null,null,null,null,null,null,750,500]
[50,"ZARAGOZA",50007,7,"ALADRÉN",null,null,null,null,null,null,null,null,null,null,null,null,null,750,500]
[50,"ZARAGOZA",50008,8,"ALAGÓN",4000,null,3000,null,null,null,15000,12500,null,null,6654.2240000000002,300,300,850,500]
[50,"ZARAGOZA",50009,9,"ALARBA",null,null,null,null,null,null,null,null,null,null,null,null,null,650,400]
[50,"ZARAGOZA",50010,10,"ALBERITE DE SAN JUAN",null,null,null,null,null,null,null,null,null,null,null,null,null,750,500]
[50,"ZARAGOZA",50011,11,"ALBETA",null,null,null,null,null,null,null,null,null,null,null,null,null,750,500]
[50,"ZARAGOZA",50012,12,"ALBORGE",null,null,null,null,null,null,null,null,null,null,null,null,null,null,400]
[50,"ZARAGOZA",50013,13,"ALCALÁ DE EBRO",null,null,null,null,2500,null,15000,null,12500,null,null,250,250,750,500]
[50,"ZARAGOZA",50014,14,"ALCALÁ DE MONCAYO",null,null,null,null,null,null,null,null,null,null,null,null,null,650,400]
[50,"ZARAGOZA",50015,15,"ALCONCHEL DE ARIZA",null,null,null,null,null,null,null,null,null,null,null,null,null,1000,600]
[50,"ZARAGOZA",50016,16,"ALDEHUELA DE LIESTOS",4500,null,null,null,4000,null,null,null,null,null,7684.9160000000002,400,400,1000,750]
[50,"ZARAGOZA",50017,17,"ALFAJARÍN",null,null,null,null,2500,null,18500,12500,null,null,6337.0879999999997,250,250,750,500]
[50,"ZARAGOZA",50018,18,"ALFAMÉN",null,null,null,null,null,null,null,null,null,null,null,null,null,750,500]
[50,"ZARAGOZA",50019,19,"ALFORQUE",null,null,null,4000,null,null,null,null,null,null,null,null,null,null,400]
[50,"ZARAGOZA",50020,20,"ALHAMA DE ARAGÓN",null,null,null,null,null,null,null,null,null,null,null,null,null,750,500]
[50,"ZARAGOZA",50021,21,"ALMOCHUEL",null,null,null,4000,null,null,10000,7500,null,8500,5649.96,null,250,500,400]
[50,"ZARAGOZA",50022,22,"ALMOLDA (LA)",3000,null,3000,4000,null,null,15000,12500,12500,null,6337.0879999999997,250,250,750,500]
[50,"ZARAGOZA",50023,23,"ALMONACID DE LA CUBA",null,null,null,4000,2000,null,10000,7500,null,8500,6019.9519999999993,null,250,650,400]
[50,"ZARAGOZA",50024,24,"ALMONACID DE LA SIERRA",null,null,null,null,null,null,null,null,null,null,null,null,null,850,600]
[50,"ZARAGOZA",50025,25,"ALMUNIA DE DOÑA GODINA (LA)",null,null,null,null,null,null,null,null,null,null,null,null,null,850,600]
[50,"ZARAGOZA",50026,26,"ALPARTIR",null,null,null,null,null,null,null,null,null,null,null,null,null,850,600]
[50,"ZARAGOZA",50027,27,"AMBEL",null,null,null,null,null,null,null,null,null,null,null,null,null,750,500]
[50,"ZARAGOZA",50028,28,"ANENTO",null,null,null,null,null,null,null,null,null,null,null,null,null,1000,750]
[50,"ZARAGOZA",50029,29,"ANIÑÓN",null,null,null,null,null,null,null,null,null,null,null,null,null,650,400]
{"$rows_left_out":265}
{"sheet":"VALORES_TE","index":1,"n_rows":240,"n_cols":16,"rows_kept":240,"cut":false,"hidden":true,"merged":[]}
[null,"      V A L O R E S      ","Provincia de Teruel"]
[null,2025,"Precios aplicables a fincas rústicas en  Euros por Hectárea"]
[null,null,"Secanos",null,null,null,"Regadíos",null,null,null,null,"No cultivados"]
[null,"PUEBLOS","AM-F","C","O","V","CR","FR","AR","OR","VR","EP","MT-MB","MM","RI"]
[1,"ABABUJ",null,null,null,null,null,null,null,null,null,null,null,null,580,1]
[2,"ABEJUELA",2150,null,null,null,null,null,null,null,null,null,null,null,500]
[3,"AGUATÓN",null,null,null,null,null,null,null,null,null,null,null,null,530]
[4,"AGUAVIVA",null,null,null,2500,null,null,null,null,null,null,null,null,550]
[5,"AGUILAR DEL ALFAMBRA",null,null,null,null,null,null,null,null,null,null,null,null,580]
[6,"ALACÓN",null,null,null,2250,null,null,null,9900,6500,null,null,null,580]
[7,"ALBA DEL CAMPO",2500,null,null,null,null,null,null,null,null,null,null,850,580]
[8,"ALBALATE DEL ARZOBISPO",null,null,null,2500,null,9500,10500,null,10000,null,null,850,600]
[9,"ALBARRACÍN",null,null,null,null,null,6700,null,null,null,null,null,1350,600]
[10,"ALBENTOSA",2500,null,null,null,null,null,null,null,null,null,null,null,550]
[11,"ALCAINE",null,null,null,2250,null,6200,null,8600,null,null,null,null,600]
[12,"ALCALÁ DE LA SELVA",null,null,null,null,null,null,null,null,null,null,null,null,580]
[13,"ALCAÑIZ",null,null,null,3100,null,null,null,null,10500,null,null,null,600]
[14,"ALCORISA",null,null,null,2900,null,null,null,null,9500,null,null,null,550]
[15,"ALFAMBRA",null,null,null,null,null,null,null,null,null,null,null,null,550]
[16,"ALIAGA",null,null,null,null,null,null,null,null,null,null,null,null,580]
[17,"ALMOHAJA",null,null,null,null,null,null,null,null,null,null,null,null,580]
[18,"ALOBRAS",null,null,null,null,null,null,null,null,null,null,null,1100,580]
[19,"ALPEÑES",null,null,null,null,null,null,null,null,null,null,null,null,550]
[20,"ALLEPUZ",null,null,null,null,null,null,null,null,null,null,null,null,550]
[21,"ALLOZA",null,null,null,2300,null,9000,9100,10800,null,null,null,null,550]
[22,"ALLUEVA",null,null,null,null,null,null,null,null,null,null,null,null,580]
[23,"ANADÓN",null,null,null,null,null,null,null,null,null,null,null,null,580]
[24,"ANDORRA",null,null,null,2300,null,9000,9100,11200,9100,null,null,null,580]
[25,"ARCOS DE LAS SALINAS",2200,null,null,null,null,7000,null,null,null,null,null,1050,500]
[26,"ARENS DE LLEDÓ",null,null,null,2700,null,null,null,null,9100,null,null,null,550]
{"$rows_left_out":211}
{"sheet":"VALORES_HU","index":2,"n_rows":207,"n_cols":20,"rows_kept":207,"cut":false,"hidden":true,"merged":[[0,2,0,18],[1,1,1,18],[3,1,4,1],[3,2,3,6]]}
[null,"VALORES","Provincia de Huesca"]
[null,"VER LAS NORMAS DE APLICACIÓN DE VALORES MINIMOS INFORMATIVOS"]
[null,2025,"Precios aplicables a fincas rústicas en  Euros por Hectarea"]
[null,"PUEBLOS","Secanos",null,null,null,null,"Regadíos",null,null,null,null,null,null,"No cultivables"]
[null,null,"AM","C","O","V","PD","CR","FR","HR","PR","AR","OR","VR","E","MB","MT","MM","RI"]
[1,"ABIEGO","  ",null,"  ","  ",5500,null,14500,null,null,12200,11900,15000,"  ","  ",600,1700,1100,1]
[2,"ABIZANDA",5500,null,5300,7200,"  ",null,14500,null,null,10100,9900,12900,"  ","  ",400,"  ",900]
[3,"ADAHUESCA","  ",null,"  ","  ",5500,null,14500,null,null,12200,11900,15000,"  ","  ",600,1700,1100]
[4,"AGUERO",4600,null,5500,6300,"  ",null,14500,null,null,12200,11900,15000,"  ","  ",400,"  ",800]
[5,"AINSA-SOBRARBE",5800,null,5500,7500,"  ",null,14500,null,null,12300,12000,15100,"  ","  ",500,"  ",1000]
[6,"AISA",5000,null,4600,6600,"  ",null,14500,null,null,10100,9900,12900,"  ","  ",400,"  ",800]
[7,"ALBALATE DE CINCA",3400,null,"  ",5100,2300,null,"  ",null,null,14500,14200,17300,200,200,200,800,600]
[8,"ALBALATILLO",3200,null,3000,4800,2100,null,20800,null,null,15600,15400,18400,200,200,200,700,400]
[9,"ALBELDA",5500,null,"  ",7200,4400,null,"  ",null,null,16800,16600,19600,400,400,400,1300,900]
[10,"ALBERO ALTO","  ",null,"  ","  ",5100,null,14500,null,null,15600,15400,18400,"  ","  ",500,1500,1100]
[11,"ALBERO BAJO",5700,null,5500,7400,4600,null,14500,null,null,15600,15400,18400,500,500,500,1400,1000]
[12,"ALBERUELA DE TUBO",3600,null,3400,5300,2500,null,20800,null,null,15600,15400,18400,300,300,300,800,600]
[13,"ALCALA DE GURREA","  ",null,"  ","  ",4400,null,14500,null,null,13300,13100,16100,"  ","  ",400,1300,900]
[14,"ALCALA DEL OBISPO","  ",null,"  ","  ",5300,null,14500,null,null,13300,13100,16100,"  ","  ",500,1700,1100]
[15,"ALCAMPELL",5500,null,"  ",7200,4400,null,"  ",null,null,16800,16600,19600,400,400,400,1300,900]
[16,"ALCOLEA DE CINCA",3400,null,"  ",5100,2300,null,"  ",null,null,14500,14200,17300,200,200,200,800,600]
[17,"ALCUBIERRE",3200,null,3000,4800,2100,null,20800,null,null,14500,14200,17300,200,200,200,700,400]
[18,"ALERRE","  ",null,"  ","  ",5800,null,14500,null,null,12200,11900,15000,"  ","  ",600,1800,1200]
[19,"ALFANTEGA",5000,null,"  ",6600,3900,null,"  ",null,null,14500,14200,17300,400,400,400,1200,800]
[20,"ALMUDEVAR","  ",null,"  ","  ",4800,null,14500,null,null,15600,15400,18400,"  ","  ",500,1500,1000]
[21,"ALMUNIA DE SAN JUAN",5500,null,"  ",7200,4400,null,"  ",null,null,16800,16600,19600,400,400,400,1300,900]
[22,"ALMUNIENTE",4100,null,3700,5700,3000,null,14500,null,null,14500,14200,17300,300,300,300,900,700]
[23,"ALQUEZAR","  ",null,"  ","  ",3500,null,14500,null,null,12200,11900,15000,"  ","  ",400,1100,800]
[24,"ALTORRICON",5000,null,"  ",6600,3900,null,"  ",null,null,16800,16600,19600,400,400,400,1200,800]
[25,"ANGUES","  ",null,"  ","  ",5300,null,14500,null,null,12200,11900,15000,"  ","  ",500,1700,1100]
{"$rows_left_out":178}
{"sheet":"NORMAS","index":3,"n_rows":25,"n_cols":2,"rows_kept":25,"cut":false,"hidden":false,"merged":[[1,1,1,10],[2,1,2,10],[24,1,24,10],[28,1,28,10]]}
[]
[]
[null,"NORMAS DE APLICACIÓN DE LOS VALORES MINIMOS INFORMATIVOS"]
[null,"La Ley 11/2021, de 9 de julio, de medidas de prevención y lucha contra el fraude fiscal y de transposición de la Directiva (EU) 2016/1164, ha introducido"]
[null,"importantes novedades, entre ellas, el denominado “valor de referencia” como concepto determinante de la base imponible en el impuesto de Transmisiones"]
[null,"Patrimoniales y Actos Jurídicos Documentados, en el impuesto de Sucesiones y Donaciones, y en el impuesto sobre el Patrimonio. En el caso de no existir  "]
[null,"el citado valor de referencia a la fecha de devengo, la base imponible será el valor de mercado."]
[]
[]
[null,"Se publican estos valores mínimos informativos a efectos de lo previsto en la RESOLUCIÓN de 21 de diciembre de 2021, del Director General de Tributos, "]
[null,"por la que se dictan instrucciones sobre el suministro de información de valores de bienes inmuebles que vayan a ser objeto de adquisición o transmisión "]
[null,"en el ámbito de la Comunidad Autónoma de Aragón, a los efectos de liquidación de los impuestos de Transmisiones Patrimoniales y Actos Jurídicos "]
[null,"Documentados y de Sucesiones y Donaciones. Ver en esta misma página web."]
[]
[null,"En el caso de que no exista valor de referencia para un bien inmueble concreto puede solicitar una valoración individualizada del mismo solicitando una"]
[null,"Información del valor con carácter previo a su adquisición o transmisión a efectos de los Impuestos de Transmisiones Patrimoniales y Actos"]
[null,"Jurídicos Documentales y de Sucesiones y Donaciones."]
[]
[null,"Estos Informes pueden solicitarse en la Dirección General de Tributos o en las Subdirecciones Provinciales de Huesca y Teruel, preferentemente de forma"]
[null,"telématica."]
[]
[null,"Para más información puede consultarse la siguiente página web: https://www.aragon.es/-/procedimiento-de-valoracion-de-previa-de-bienes-inmuebles"]
[]
[]
[null,"RUSTICA. Año 2025"]

{"sheet":"MANEJO DE LAS TABLAS","index":4,"n_rows":42,"n_cols":4,"rows_kept":42,"cut":false,"hidden":false,"merged":[[0,1,0,5]]}
[null,"MANEJO DE LAS TABLAS"]
[]
[null,"Las tablas vienen ordenadas por provincias"]
[]
[null,"En cada provincia aparecen los Términos Municipales ordenados alfabéticamente"]
[]
[null,"En las tablas aparecen los valores medios de la tierra, en Euros por hectárea (Euros/ha) según los"]
[null,"diferentes tipos de aprovechamiento, identificados con los Códigos del cuadro adjunto."]
[]
[null,"Para obtener el valor de una finca, se busca en la tabla el Término Municipal dentro de la "]
[null,"provincia correspondiente. Se busca el código con arreglo al aprovechamiento de la finca (Labor "]
[null,"secano,  Almendro secano,  etc.) y obtenemos  el precio unitario en Euros/ha. Para obtener el va-"]
[null,"lor total multiplicamos por el número de hectáreas que tenga la finca a valorar. Cuando existan"]
[null,"varios tipos de aprovechamiento se buscarán los correspondientes valores y se multiplicará el "]
[null,"valor de cada tipo por su superficie. Cuando sumamos los resultados parciales obtenemos el valor"]
[null,"total de la finca. Las equivalencias de las unidades de superficie son las siguientes."]
[]
[null,null,"1 Hectárea = 10.000 metros cuadrados"]
[null,null,"1 Área= 100 metros cuadrados"]
[null,null,"1 Centiárea = 1 metro cuadrado"]
[]
[null,null,"Tipo de aprovechamiento","Código"]
[null,null,"Almendro secano","AM"]
[null,null,"Almendro regadio","AR"]
[null,null,"Labor secano","C"]
[null,null,"Labor regadío","CR"]
[null,null,"Erial a pastos","EP"]
[null,null,"Frutales de secano","F"]
[null,null,"Haya","FH"]
[null,null,"Frutales de regadío","FR"]
{"$rows_left_out":13}
{"sheet":"HUESCA 2025","index":5,"n_rows":18,"n_cols":17,"rows_kept":18,"cut":false,"hidden":false,"merged":[[1,1,1,16],[2,1,2,16],[3,3,3,16],[4,2,4,6],[4,7,4,11],[4,12,4,16]]}
[]
[null,"Provincia de HUESCA"]
[null,"VER LAS NORMAS DE APLICACIÓN DE VALORES MINIMOS INFORMATIVOS"]
[null,2025,null,"Precios aplicables a fincas rústicas en Euros por hectárea"]
[null,"MUNICIPIO","Secanos",null,null,null,null,"Regadíos",null,null,null,null,"No cultivables"]
[null,null,"AM-F","C","O","V","PD","CR","FR","AR","OR","VR","E","MB","MT","MM","RI"]
[null,"VALORES € /Ha.",{"$f":"IF(VLOOKUP(VALORES_HU!$T$6,TABLA_HU,3)=0,\"\",VLOOKUP(VALORES_HU!$T$6,TABLA_HU,3))","v":"  "},{"$f":"IF(VLOOKUP(VALORES_HU!$T$6,TABLA_HU,4)=0,\"\",VLOOKUP(VALORES_HU!$T$6,TABLA_HU,4))","v":""},{"$f":"IF(VLOOKUP(VALORES_HU!$T$6,TABLA_HU,5)=0,\"\",VLOOKUP(VALORES_HU!$T$6,TABLA_HU,5))","v":"  "},{"$f":"IF(VLOOKUP(VALORES_HU!$T$6,TABLA_HU,6)=0,\"\",VLOOKUP(VALORES_HU!$T$6,TABLA_HU,6))","v":"  "},{"$f":"IF(VLOOKUP(VALORES_HU!$T$6,TABLA_HU,7)=0,\"\",VLOOKUP(VALORES_HU!$T$6,TABLA_HU,7))","v":5500},{"$f":"IF(VLOOKUP(VALORES_HU!$T$6,TABLA_HU,8)=0,\"\",VLOOKUP(VALORES_HU!$T$6,TABLA_HU,8))","v":""},{"$f":"IF(VLOOKUP(VALORES_HU!$T$6,TABLA_HU,9)=0,\"\",VLOOKUP(VALORES_HU!$T$6,TABLA_HU,9))","v":14500},{"$f":"IF(VLOOKUP(VALORES_HU!$T$6,TABLA_HU,12)=0,\"\",VLOOKUP(VALORES_HU!$T$6,TABLA_HU,12))","v":12200},{"$f":"IF(VLOOKUP(VALORES_HU!$T$6,TABLA_HU,13)=0,\"\",VLOOKUP(VALORES_HU!$T$6,TABLA_HU,13))","v":11900},{"$f":"IF(VLOOKUP(VALORES_HU!$T$6,TABLA_HU,14)=0,\"\",VLOOKUP(VALORES_HU!$T$6,TABLA_HU,14))","v":15000},{"$f":"IF(VLOOKUP(VALORES_HU!$T$6,TABLA_HU,15)=0,\"\",VLOOKUP(VALORES_HU!$T$6,TABLA_HU,15))","v":"  "},{"$f":"IF(VLOOKUP(VALORES_HU!$T$6,TABLA_HU,16)=0,\"\",VLOOKUP(VALORES_HU!$T$6,TABLA_HU,16))","v":"  "},{"$f":"IF(VLOOKUP(VALORES_HU!$T$6,TABLA_HU,17)=0,\"\",VLOOKUP(VALORES_HU!$T$6,TABLA_HU,17))","v":600},{"$f":"IF(VLOOKUP(VALORES_HU!$T$6,TABLA_HU,18)=0,\"\",VLOOKUP(VALORES_HU!$T$6,TABLA_HU,18))","v":1700},{"$f":"IF(VLOOKUP(VALORES_HU!$T$6,TABLA_HU,19)=0,\"\",VLOOKUP(VALORES_HU!$T$6,TABLA_HU,19))","v":1100}]
[]
[null,"ACLARACIONES. (SOLO utilizar para fincas SIN Valor de Referencia del Catastro)"]
[null,"PLANTACIONES DE CARRASCAS TRUFERAS (FRONDOSAS MICORRIZADAS), CUALQUIERA QUE SEA SU CALIFICACION EN "]
[null,"CATASTRO (MB, C, AM, etc.). Se valorarán de forma individualizada y de acuerdo con sus características particulares (densidad y año "]
[null,"de plantación, secano o regadío, vallado…)"]
[null,"En las parcelas de regadío equipadas con sistemas de riego automatizado, el valor de labor de regadío es de 18.000 Euros/ha"]
[null,"Parcelas incluidas en Zonas de Interes Nacional, PEBEAS y Regadíos Sociales en transformación, el valor por ha será 2,50 veces el valor   "]
[null,"de secano (TAS) correspondiente de la ATH del IAMIR (Informe Anual del Mercado Inmobiliario Rústico. Sede Electrónica del Catastro)."]
[null,"Para las Referencias Catastrales con calificación RI \"árboles de ribera\", habrá que distinguir: "]
[null,"a.- parcela NO CULTIVADA, se aplica el valor minimo informativo asignado a RI"]
[null,"b.- PLANTACIONES DE CHOPOS. Aplicar el 80% del valor de regadío (TAR)  correspondiente de la ATH del IAMIR antes mencionado."]

{"sheet":"ZARAGOZA 2025","index":6,"n_rows":18,"n_cols":16,"rows_kept":18,"cut":false,"hidden":false,"merged":[[4,2,4,6],[4,7,4,11],[4,12,4,15],[1,1,1,15],[2,1,2,15],[3,3,3,15]]}
[]
[null,"Provincia de ZARAGOZA"]
[null,"VER LAS NORMAS DE APLICACIÓN DE VALORES MINIMOS INFORMATIVOS"]
[null,2025,null,"Precios aplicables a fincas rústicas en Euros por hectárea"]
[null,"MUNICIPIO","Secanos",null,null,null,null,"Regadíos",null,null,null,null,"No cultivables"]
[null,null,"AM-F","C","O","V","PD","CR","FR","AR","OR","VR","EP","MB-MT","MM","RI"]
[null,"VALORES € /Ha.",{"$f":"IF(VLOOKUP(VALORES_ZA!$U$2,TABLA_ZA,3)=0,\"\",VLOOKUP(VALORES_ZA!$U$2,TABLA_ZA,3))","v":""},{"$f":"IF(VLOOKUP(VALORES_ZA!$U$2,TABLA_ZA,4)=0,\"\",VLOOKUP(VALORES_ZA!$U$2,TABLA_ZA,4))","v":""},{"$f":"IF(VLOOKUP(VALORES_ZA!$U$2,TABLA_ZA,5)=0,\"\",VLOOKUP(VALORES_ZA!$U$2,TABLA_ZA,5))","v":""},{"$f":"IF(VLOOKUP(VALORES_ZA!$U$2,TABLA_ZA,6)=0,\"\",VLOOKUP(VALORES_ZA!$U$2,TABLA_ZA,6))","v":""},{"$f":"IF(VLOOKUP(VALORES_ZA!$U$2,TABLA_ZA,7)=0,\"\",VLOOKUP(VALORES_ZA!$U$2,TABLA_ZA,7))","v":""},{"$f":"IF(VLOOKUP(VALORES_ZA!$U$2,TABLA_ZA,8)=0,\"\",VLOOKUP(VALORES_ZA!$U$2,TABLA_ZA,8))","v":""},{"$f":"IF(VLOOKUP(VALORES_ZA!$U$2,TABLA_ZA,9)=0,\"\",VLOOKUP(VALORES_ZA!$U$2,TABLA_ZA,9))","v":""},{"$f":"IF(VLOOKUP(VALORES_ZA!$U$2,TABLA_ZA,10)=0,\"\",VLOOKUP(VALORES_ZA!$U$2,TABLA_ZA,10))","v":""},{"$f":"IF(VLOOKUP(VALORES_ZA!$U$2,TABLA_ZA,11)=0,\"\",VLOOKUP(VALORES_ZA!$U$2,TABLA_ZA,11))","v":""},{"$f":"IF(VLOOKUP(VALORES_ZA!$U$2,TABLA_ZA,12)=0,\"\",VLOOKUP(VALORES_ZA!$U$2,TABLA_ZA,12))","v":""},{"$f":"IF(VLOOKUP(VALORES_ZA!$U$2,TABLA_ZA,14)=0,\"\",VLOOKUP(VALORES_ZA!$U$2,TABLA_ZA,14))","v":""},{"$f":"IF(VLOOKUP(VALORES_ZA!$U$2,TABLA_ZA,15)=0,\"\",VLOOKUP(VALORES_ZA!$U$2,TABLA_ZA,15))","v":""},{"$f":"IF(VLOOKUP(VALORES_ZA!$U$2,TABLA_ZA,16)=0,\"\",VLOOKUP(VALORES_ZA!$U$2,TABLA_ZA,16))","v":1000},{"$f":"IF(VLOOKUP(VALORES_ZA!$U$2,TABLA_ZA,17)=0,\"\",VLOOKUP(VALORES_ZA!$U$2,TABLA_ZA,17))","v":750}]
[]
[null,"ACLARACIONES. (SOLO utilizar para fincas SIN Valor de Referencia del Catastro)"]
[null,"PLANTACIONES DE CARRASCAS TRUFERAS (FRONDOSAS MICORRIZADAS), CUALQUIERA QUE SEA SU CALIFICACION EN "]
[null,"CATASTRO (MB, C, AM, etc.). Se valorarán de forma individualizada y de acuerdo con sus características particulares (densidad y año "]
[null,"de plantación, secano o regadío, vallado…)"]
[null,"En las parcelas de regadío equipadas con sistemas de riego automatizado, el valor de labor de regadío es de 18.000 Euros/ha"]
[null,"Parcelas incluidas en Zonas de Interes Nacional, PEBEAS y Regadíos Sociales en transformación, el valor por ha será 2,50 veces el valor   "]
[null,"de secano (TAS) correspondiente de la ATH del IAMIR (Informe Anual del Mercado Inmobiliario Rústico. Sede Electrónica del Catastro)."]
[null,"Para las Referencias Catastrales con calificación RI \"árboles de ribera\", habrá que distinguir: "]
[null,"a.- parcela NO CULTIVADA, se aplica el valor minimo informativo asignado a RI"]
[null,"b.- PLANTACIONES DE CHOPOS. Aplicar el 80% del valor de regadío (TAR)  correspondiente de la ATH del IAMIR antes mencionado."]

{"sheet":"TERUEL 2025","index":7,"n_rows":18,"n_cols":15,"rows_kept":18,"cut":false,"hidden":false,"merged":[[1,1,1,14],[2,1,2,14],[3,3,3,14],[4,2,4,5],[4,6,4,10],[4,11,4,14]]}
[]
[null,"Provincia de TERUEL"]
[null,"VER LAS NORMAS DE APLICACIÓN DE VALORES MINIMOS INFORMATIVOS"]
[null,2025,null,"Precios aplicables a fincas rústicas en Euros por hectárea"]
[null,"MUNICIPIO","Secanos",null,null,null,"Regadíos",null,null,null,null,"No cultivables"]
[null,null,"AM-F","C","O","V","CR","FR","AR","OR","VR","EP","MB-MT","MM","RI"]
[null,"VALORES € /Ha.",{"$f":"IF(VLOOKUP(VALORES_TE!$P$5,TABLA_TE,3)=0,\"\",VLOOKUP(VALORES_TE!$P$5,TABLA_TE,3))","v":""},{"$f":"IF(VLOOKUP(VALORES_TE!$P$5,TABLA_TE,4)=0,\"\",VLOOKUP(VALORES_TE!$P$5,TABLA_TE,4))","v":""},{"$f":"IF(VLOOKUP(VALORES_TE!$P$5,TABLA_TE,5)=0,\"\",VLOOKUP(VALORES_TE!$P$5,TABLA_TE,5))","v":""},{"$f":"IF(VLOOKUP(VALORES_TE!$P$5,TABLA_TE,6)=0,\"\",VLOOKUP(VALORES_TE!$P$5,TABLA_TE,6))","v":""},{"$f":"IF(VLOOKUP(VALORES_TE!$P$5,TABLA_TE,7)=0,\"\",VLOOKUP(VALORES_TE!$P$5,TABLA_TE,7))","v":""},{"$f":"IF(VLOOKUP(VALORES_TE!$P$5,TABLA_TE,8)=0,\"\",VLOOKUP(VALORES_TE!$P$5,TABLA_TE,8))","v":""},{"$f":"IF(VLOOKUP(VALORES_TE!$P$5,TABLA_TE,9)=0,\"\",VLOOKUP(VALORES_TE!$P$5,TABLA_TE,9))","v":""},{"$f":"IF(VLOOKUP(VALORES_TE!$P$5,TABLA_TE,10)=0,\"\",VLOOKUP(VALORES_TE!$P$5,TABLA_TE,10))","v":""},{"$f":"IF(VLOOKUP(VALORES_TE!$P$5,TABLA_TE,11)=0,\"\",VLOOKUP(VALORES_TE!$P$5,TABLA_TE,11))","v":""},{"$f":"IF(VLOOKUP(VALORES_TE!$P$5,TABLA_TE,12)=0,\"\",VLOOKUP(VALORES_TE!$P$5,TABLA_TE,12))","v":""},{"$f":"IF(VLOOKUP(VALORES_TE!$P$5,TABLA_TE,13)=0,\"\",VLOOKUP(VALORES_TE!$P$5,TABLA_TE,13))","v":""},{"$f":"IF(VLOOKUP(VALORES_TE!$P$5,TABLA_TE,14)=0,\"\",VLOOKUP(VALORES_TE!$P$5,TABLA_TE,14))","v":""},{"$f":"IF(VLOOKUP(VALORES_TE!$P$5,TABLA_TE,15)=0,\"\",VLOOKUP(VALORES_TE!$P$5,TABLA_TE,15))","v":580}]
[]
[null,"ACLARACIONES. (SOLO utilizar para fincas SIN Valor de Referencia del Catastro)"]
[null,"PLANTACIONES DE CARRASCAS TRUFERAS (FRONDOSAS MICORRIZADAS), CUALQUIERA QUE SEA SU CALIFICACION EN "]
[null,"CATASTRO (MB, C, AM, etc.). Se valorarán de forma individualizada y de acuerdo con sus características particulares (densidad y año "]
[null,"de plantación, secano o regadío, vallado…)"]
[null,"En las parcelas de regadío equipadas con sistemas de riego automatizado, el valor de labor de regadío es de 18.000 Euros/ha"]
[null,"Parcelas incluidas en Zonas de Interes Nacional, PEBEAS y Regadíos Sociales en transformación, el valor por ha será 2,50 veces el valor   "]
[null,"de secano (TAS) correspondiente de la ATH del IAMIR (Informe Anual del Mercado Inmobiliario Rústico. Sede Electrónica del Catastro)."]
[null,"Para las Referencias Catastrales con calificación RI \"árboles de ribera\", habrá que distinguir: "]
[null,"a.- parcela NO CULTIVADA, se aplica el valor minimo informativo asignado a RI"]
[null,"b.- PLANTACIONES DE CHOPOS. Aplicar el 80% del valor de regadío (TAR)  correspondiente de la ATH del IAMIR antes mencionado."]