{"text_format":"1","workbook":"xlsx","n_sheets":3,"sheets":["DIBUJAR","datos","datosext"],"not_rendered":{"charts":1,"images":3,"macros":0,"external_links":0,"defined_names":6,"comments":0,"pivot_tables":0},"unopened":[],"bounds":{"document_bytes":16777216,"sheet_cells":100000,"rows_first":2000,"rows_last":500,"rows_between":2000,"halvings":0,"cell_chars":16384,"cell_head_chars":4096},"cells_cut":0,"cells_raw":0,"read":"whole","date_system":"1900"}

{"sheet":"DIBUJAR","index":0,"n_rows":55,"n_cols":15,"rows_kept":55,"cut":false,"hidden":false,"merged":[]}
["Pirámides de población a 1 de enero de 2022",null,null,null,null,"(Revisión del Padrón Municipal de Habitantes a 1 de enero de 2007)"]
["Fuente: Padrón Municipal de Habitantes a 1 de enero de 2022",null,null,null,null,"Elaboración: Instituto Aragonés de Estadística"]
["Elaboración. Instituto Aragonés de Estadística."]
[]
["Elegir territorio"]
[null,null,{"$f":"VLOOKUP(F6,datos!A2:B769,2)","v":"ARAGÓN"},null,null,1,null,null,null,null,null,null,"extranjeros"]
[null,null,null,null,null,null,null,null,{"$f":"B6&\" \"&C6","v":" ARAGÓN"},null,null,null,{"$f":"B6&\" \"&C6","v":" ARAGÓN"}]
[null,"Total población"]
[null,"Edad","Ambos Sexos","Hombre","Mujer",null,null,"datos dibujo",{"$f":"D9","v":"Hombre"},{"$f":"E9","v":"Mujer"},"TOTALES","datos dibujo","Hombre","Mujer","TOTALES"]
[null,"0 a 4",{"$f":"D10+E10","v":49782},{"$f":"VLOOKUP($F$6,datos!$A$2:$AS$769,5)","v":25557},{"$f":"VLOOKUP($F$6,datos!$A$2:$AS$769,26)","v":24225},null,null,{"$f":"B10","v":"0 a 4"},{"$f":"-D10/$C$30","v":-1.9269178136415557E-2},{"$f":"E10/$C$30","v":1.8264891824340372E-2},{"$f":"J10-I10","v":3.7534069960755929E-2},{"$f":"B10","v":"0 a 4"},{"$f":"-D35/$C$30","v":-3.4629782517727691E-3},{"$f":"E35/C$30","v":3.2684543264609087E-3},{"$f":"-M10+N10","v":6.7314325782336778E-3}]
[null,"5 a 9",61253,{"$f":"VLOOKUP($F$6,datos!$A$2:$AS$769,6)","v":31457},{"$f":"VLOOKUP($F$6,datos!$A$2:$AS$769,27)","v":29796},null,null,"5 a 9",-2.3717593482694532E-2,2.2465251467411587E-2,4.6182844950106119E-2,{"$f":"B11","v":"5 a 9"},{"$f":"-D36/$C$30","v":-3.5866291190252693E-3},{"$f":"E36/C$30","v":3.3476210402506191E-3},{"$f":"N11-M11","v":6.9342501592758888E-3}]
[null,"10 a 14",67610,{"$f":"VLOOKUP($F$6,datos!$A$2:$AS$769,7)","v":34840},{"$f":"VLOOKUP($F$6,datos!$A$2:$AS$769,28)","v":32770},null,null,"10 a 14",-2.6268269604128733E-2,2.4707554389417297E-2,5.0975823993546027E-2,"10 a 14",-3.2865495753271281E-3,2.9781763758986364E-3,6.2647259512257645E-3]
[null,"15 a 19",65311,{"$f":"VLOOKUP($F$6,datos!$A$2:$AS$769,8)","v":33845},{"$f":"VLOOKUP($F$6,datos!$A$2:$AS$769,29)","v":31466},null,null,"15 a 19",-2.5518070744883381E-2,2.3724379201019365E-2,4.9242449945902746E-2,"15 a 19",-3.412462348687906E-3,2.853017571240618E-3,6.265479919928524E-3]
[null,"20 a 24",64832,{"$f":"VLOOKUP($F$6,datos!$A$2:$AS$769,9)","v":33757},{"$f":"VLOOKUP($F$6,datos!$A$2:$AS$769,30)","v":31075},null,null,"20 a 24",-2.5451721499040576E-2,2.3429577438240538E-2,4.8881298937281117E-2,"20 a 24",-4.8269076350640682E-3,4.2116691736126029E-3,9.0385768086766703E-3]
[null,"25 a 29",66442,{"$f":"VLOOKUP($F$6,datos!$A$2:$AS$769,10)","v":34209},{"$f":"VLOOKUP($F$6,datos!$A$2:$AS$769,31)","v":32233},null,null,"25 a 29",-2.5792515352687711E-2,2.4302673196035633E-2,5.0095188548723343E-2,"25 a 29",-5.7738923257295589E-3,5.5620271202542386E-3,1.1335919445983798E-2]
[null,"30 a 34",71681,{"$f":"VLOOKUP($F$6,datos!$A$2:$AS$769,11)","v":36527},{"$f":"VLOOKUP($F$6,datos!$A$2:$AS$769,32)","v":35154},null,null,"30 a 34",-2.7540214805683416E-2,2.6505015776795104E-2,5.4045230582478523E-2,"30 a 34",-6.2240116412767702E-3,6.8754406004606751E-3,1.3099452241737445E-2]
[null,"35 a 39",82576,{"$f":"VLOOKUP($F$6,datos!$A$2:$AS$769,12)","v":42012},{"$f":"VLOOKUP($F$6,datos!$A$2:$AS$769,33)","v":40564},null,null,"35 a 39",-3.1675733140317346E-2,3.0583986458722099E-2,6.2259719599039448E-2,"35 a 39",-6.8890120371103399E-3,7.3089726045471853E-3,1.4197984641657526E-2]
[null,"40 a 44",102772,{"$f":"VLOOKUP($F$6,datos!$A$2:$AS$769,13)","v":52355},{"$f":"VLOOKUP($F$6,datos!$A$2:$AS$769,34)","v":50417},null,null,"40 a 44",-3.947403143295522E-2,3.801284008700799E-2,7.748687151996321E-2,"40 a 44",-7.7236553910647165E-3,7.1023851799911783E-3,1.4826040571055896E-2]
[null,"45 a 49",109283,{"$f":"VLOOKUP($F$6,datos!$A$2:$AS$769,14)","v":56300},{"$f":"VLOOKUP($F$6,datos!$A$2:$AS$769,35)","v":52983},null,null,"45 a 49",-4.2448437965340056E-2,3.9947523778287961E-2,8.239596174362801E-2,"45 a 49",-6.6801627064460552E-3,5.7180986417253816E-3,1.2398261348171437E-2]
[null,"50 a 54",103377,{"$f":"VLOOKUP($F$6,datos!$A$2:$AS$769,15)","v":52265},{"$f":"VLOOKUP($F$6,datos!$A$2:$AS$769,36)","v":51112},null,null,"50 a 54",-3.9406174249706896E-2,3.8536848335425596E-2,7.7943022585132499E-2,"50 a 54",-5.0138918733483376E-3,4.523058247852132E-3,9.5369501212004687E-3]
[null,"55 a 59",98729,{"$f":"VLOOKUP($F$6,datos!$A$2:$AS$769,16)","v":49999},{"$f":"VLOOKUP($F$6,datos!$A$2:$AS$769,37)","v":48730},null,null,"55 a 59",-3.7697681169254663E-2,3.6740894885453304E-2,7.4438576054707967E-2,"55 a 59",-3.0279383102807403E-3,2.7240889230688036E-3,5.7520272333495444E-3]
[null,"60 a 64",89733,{"$f":"VLOOKUP($F$6,datos!$A$2:$AS$769,17)","v":44338},{"$f":"VLOOKUP($F$6,datos!$A$2:$AS$769,38)","v":45395},null,null,"60 a 64",-3.3429464342935124E-2,3.4226409261751543E-2,6.7655873604686667E-2,"60 a 64",-1.8396836347323222E-3,1.8411915721378406E-3,3.6808752068701626E-3]
[null,"65 a 69",74669,{"$f":"VLOOKUP($F$6,datos!$A$2:$AS$769,18)","v":36082},{"$f":"VLOOKUP($F$6,datos!$A$2:$AS$769,39)","v":38587},null,null,"65 a 69",-2.7204698732955595E-2,2.9093390333367261E-2,5.6298089066322859E-2,"65 a 69",-9.6357200212619169E-4,1.152818146518738E-3,2.1163901486449298E-3]
[null,"70 a 74",65322,{"$f":"VLOOKUP($F$6,datos!$A$2:$AS$769,19)","v":30505},{"$f":"VLOOKUP($F$6,datos!$A$2:$AS$769,40)","v":34817},null,null,"70 a 74",-2.2999815277667823E-2,2.6250928323965271E-2,4.925074360163309E-2,"70 a 74",-4.2071453613960486E-4,6.2730196069561153E-4,1.0480164968352163E-3]
[null,"75 a 79",55970,{"$f":"VLOOKUP($F$6,datos!$A$2:$AS$769,20)","v":25051},{"$f":"VLOOKUP($F$6,datos!$A$2:$AS$769,41)","v":30919},null,null,"75 a 79",-1.8887669972819428E-2,2.3311958320610112E-2,4.2199628293429541E-2,"75 a 79",-2.0357154974497008E-4,3.2797638570022957E-4,5.3154793544519965E-4]
[null,"80 a 84",38918,{"$f":"VLOOKUP($F$6,datos!$A$2:$AS$769,21)","v":16213},{"$f":"VLOOKUP($F$6,datos!$A$2:$AS$769,42)","v":22705},null,null,"80 a 84",-1.2224094577834074E-2,1.7118859396146466E-2,2.934295397398054E-2,"80 a 84",-1.1460324281939057E-4,1.6662708330977182E-4,2.812303261291624E-4]
[null,"85 a 89",35213,{"$f":"VLOOKUP($F$6,datos!$A$2:$AS$769,22)","v":13188},{"$f":"VLOOKUP($F$6,datos!$A$2:$AS$769,43)","v":22025},null,null,"85 a 89",-9.9433392519876502E-3,1.6606160678270244E-2,2.6549499930257896E-2,"85 a 89",-4.5992090868308059E-5,9.0476244331097813E-5,1.3646833519940588E-4]
[null,"90 a 94",17595,{"$f":"VLOOKUP($F$6,datos!$A$2:$AS$769,23)","v":5682},{"$f":"VLOOKUP($F$6,datos!$A$2:$AS$769,44)","v":11913},null,null,"90 a 94",-4.2840501690774814E-3,8.9820291559697361E-3,1.3266079325047218E-2,"90 a 94",-1.1309530541387227E-5,2.7896842002088494E-5,3.920637254347572E-5]
[null,"95 y más",5247,{"$f":"VLOOKUP($F$6,datos!$A$2:$AS$769,24)","v":1294},{"$f":"VLOOKUP($F$6,datos!$A$2:$AS$769,45)","v":3953},null,null,"95 y más",-9.7563550137033813E-4,2.9804382820069141E-3,3.956073783377252E-3,"95 y más",-1.507937405518297E-6,9.047624433109781E-6,1.0555561838628078E-5]
[null,"Total general",{"$f":"SUM(C10:C29)","v":1326315},{"$f":"SUM(D10:D29)","v":655476},{"$f":"SUM(E10:E29)","v":670839},null,null,null,-0.49420838940975559,0.50579161059024436,1,null,{"$f":"-D55/$C$55","v":-0.51124045593037226},{"$f":"E55/C$55","v":0.48875954406962768},1]
{"$rows_left_out":26}
{"sheet":"datos","index":1,"n_rows":773,"n_cols":45,"rows_kept":773,"cut":false,"hidden":true,"merged":[]}
[null,"referencia geográfica","código","TOTAL VARONES","01- de 0 a 4","02- de 5 a 9","03- de 10 a 14","04- de 15 a 19","05- de 20 a 24","06- de 25 a 29","07- de 30 a 34","08- de 35 a 39","09- de 40 a 44","10- de 45 a 49","11- de 50 a 54","12- de 55 a 59","13- de 60 a 64","14- de 65 a 69","15- de 70 a 74","16- de 75 a 79","17- de 80 a 84","18- de 85 a 89","19- de 90 a 94","20- de 95 y más","TOTAL MUJERES","01- de 0 a 4","02- de 5 a 9","03- de 10 a 14","04- de 15 a 19","05- de 20 a 24","06- de 25 a 29","07- de 30 a 34","08- de 35 a 39","09- de 40 a 44","10- de 45 a 49","11- de 50 a 54","12- de 55 a 59","13- de 60 a 64","14- de 65 a 69","15- de 70 a 74","16- de 75 a 79","17- de 80 a 84","18- de 85 a 89","19- de 90 a 94","20- de 95 y más"]
[1,"ARAGÓN",2,{"$f":"((SUM(E2:X2)))+0","v":655476},25557,31457,34840,33845,33757,34209,36527,42012,52355,56300,52265,49999,44338,36082,30505,25051,16213,13188,5682,1294,{"$f":"(SUM(Z2:AS2))+0","v":670839},24225,29796,32770,31466,31075,32233,35154,40564,50417,52983,51112,48730,45395,38587,34817,30919,22705,22025,11913,3953]
[2,"PROVINCIA DE HUESCA",22,{"$f":"((SUM(E3:X3)))+0","v":114371},4358,5196,5657,5556,5757,6077,6379,7413,9380,9522,8956,8922,7982,6518,5426,4352,2850,2617,1148,305,{"$f":"((SUM(Z3:AS3))+0)+0","v":111085},4098,4941,5354,5109,5229,5253,5769,6635,8230,8497,8354,8188,7623,6424,5565,5042,3767,3915,2266,826]
[3,"PROVINCIA DE TERUEL",44,{"$f":"((SUM(E4:X4)))+0","v":68207},2493,3019,3234,3183,3446,3521,3806,4261,5051,5210,5109,5590,5275,4126,3320,2665,1914,1796,966,222,{"$f":"((SUM(Z4:AS4))+0)+0","v":66214},2436,2832,3195,2948,3147,3289,3554,3762,4444,4555,4985,5029,4714,3746,3289,2977,2500,2779,1535,498]
[4,"PROVINCIA DE ZARAGOZA",50,{"$f":"((SUM(E5:X5)))+0","v":472898},18706,23242,25949,25106,24554,24611,26342,30338,37924,41568,38200,35487,31081,25438,21759,18034,11449,8775,3568,767,{"$f":"((SUM(Z5:AS5))+0)+0","v":493540},17691,22023,24221,23409,22699,23691,25831,30167,37743,39931,37773,35513,33058,28417,25963,22900,16438,15331,8112,2629]
[5,"LA JACETANIA",1,{"$f":"((SUM(E6:X6)))+0","v":9327},281,386,439,393,457,523,542,614,801,788,761,765,740,561,395,344,229,186,98,24,{"$f":"((SUM(Z6:AS6))+0)+0","v":9133},310,417,424,436,437,416,441,539,734,742,705,758,673,470,409,367,277,301,215,62]
[6,"ALTO GÁLLEGO",2,{"$f":"((SUM(E7:X7)))+0","v":7087},260,266,326,304,334,357,384,493,609,583,594,611,555,432,316,233,156,179,81,14,{"$f":"((SUM(Z7:AS7))+0)+0","v":6842},227,279,326,306,312,313,362,478,525,504,574,503,513,425,286,274,232,216,149,38]
[7,"SOBRARBE",3,{"$f":"((SUM(E8:X8)))+0","v":4119},150,190,181,152,170,164,215,261,330,349,316,367,334,296,203,161,106,114,48,12,{"$f":"((SUM(Z8:AS8))+0)+0","v":3636},129,145,157,128,154,179,209,251,296,285,303,300,228,223,186,138,106,140,55,24]
[8,"LA RIBAGORZA",4,{"$f":"((SUM(E9:X9)))+0","v":6581},210,277,288,267,295,313,355,421,505,571,545,575,504,415,377,236,167,164,76,20,{"$f":"((SUM(Z9:AS9))+0)+0","v":6013},177,216,266,263,254,288,309,374,504,458,527,455,432,325,322,243,188,232,135,45]
[9,"CINCO VILLAS",5,{"$f":"((SUM(E10:X10)))+0","v":15826},509,587,711,707,850,827,895,976,1187,1308,1324,1390,1226,966,777,626,411,354,166,29,{"$f":"((SUM(Z10:AS10))+0)+0","v":14989},546,579,643,683,720,758,808,829,1014,1044,1120,1187,1134,872,766,701,555,613,323,94]
[10,"HOYA DE HUESCA/PLANA DE UESCA",6,{"$f":"((SUM(E11:X11)))+0","v":33771},1350,1699,1839,1807,1711,1794,1804,2097,2660,2801,2579,2591,2292,1907,1682,1316,774,687,297,84,{"$f":"((SUM(Z11:AS11))+0)+0","v":35111},1333,1643,1791,1689,1624,1613,1711,2046,2668,2790,2596,2499,2415,2140,1817,1645,1061,1116,655,259]
[11,"SOMONTANO DE BARBASTRO",7,{"$f":"((SUM(E12:X12)))+0","v":12065},476,535,570,572,614,614,694,771,987,927,890,914,848,712,636,489,299,326,149,42,{"$f":"((SUM(Z12:AS12))+0)+0","v":12062},445,493,596,506,575,562,649,695,855,879,881,921,880,708,620,541,438,451,272,95]
[12,"CINCA MEDIO",8,{"$f":"((SUM(E13:X13)))+0","v":12471},532,627,672,709,636,686,680,836,994,1037,1019,948,811,634,516,444,301,257,107,25,{"$f":"((SUM(Z13:AS13))+0)+0","v":11892},465,587,600,583,612,634,622,703,817,957,868,888,743,629,549,525,462,382,188,78]
[13,"LA LITERA/LA LLITERA",9,{"$f":"((SUM(E14:X14)))+0","v":9888},338,398,523,529,568,575,532,603,834,870,771,719,608,516,452,391,272,251,106,32,{"$f":"((SUM(Z14:AS14))+0)+0","v":8902},334,385,419,401,451,397,431,483,601,633,637,648,566,511,484,477,363,383,210,88]
[14,"LOS MONEGROS",10,{"$f":"((SUM(E15:X15)))+0","v":9712},322,330,342,361,423,501,538,606,744,744,751,820,767,647,529,473,354,302,127,31,{"$f":"((SUM(Z15:AS15))+0)+0","v":8861},268,299,300,363,350,384,480,488,555,605,619,681,654,579,535,528,401,427,263,82]
[15,"BAJO CINCA/BAIX CINCA",11,{"$f":"((SUM(E16:X16)))+0","v":12949},537,623,615,614,727,724,815,910,1171,1126,1044,955,774,623,511,446,331,272,105,26,{"$f":"((SUM(Z16:AS16))+0)+0","v":12009},508,603,598,576,610,620,716,756,876,887,916,798,745,623,559,506,409,421,211,71]
[16,"TARAZONA Y EL  MONCAYO",12,{"$f":"((SUM(E17:X17)))+0","v":7060},223,314,383,360,366,382,371,422,501,586,555,559,501,415,333,319,215,183,57,15,{"$f":"((SUM(Z17:AS17))+0)+0","v":6829},201,283,325,295,330,320,349,392,433,538,515,494,478,376,366,384,271,289,149,41]
[17,"CAMPO DE BORJA",13,{"$f":"((SUM(E18:X18)))+0","v":7125},226,290,338,353,342,392,365,456,516,578,591,603,511,408,358,329,210,178,74,7,{"$f":"((SUM(Z18:AS18))+0)+0","v":6581},231,218,315,293,334,285,332,368,472,473,483,501,487,350,382,324,292,257,139,45]
[18,"ARANDA",14,{"$f":"((SUM(E19:X19)))+0","v":3240},48,80,110,155,167,144,137,172,216,262,298,324,266,236,169,179,130,105,34,8,{"$f":"((SUM(Z19:AS19))+0)+0","v":2986},52,73,95,125,158,148,127,122,169,217,277,276,220,215,156,177,165,116,76,22]
[19,"RIBERA ALTA DEL EBRO",15,{"$f":"((SUM(E20:X20)))+0","v":14020},517,661,797,723,646,724,835,980,1170,1230,1233,1041,966,760,603,445,305,258,105,21,{"$f":"((SUM(Z20:AS20))+0)+0","v":13615},467,644,743,627,590,648,777,912,1164,1121,971,965,954,696,608,534,423,458,231,82]
[20,"VALDEJALÓN",16,{"$f":"((SUM(E21:X21)))+0","v":15626},674,803,852,799,807,786,978,1077,1421,1488,1367,1136,922,698,565,487,344,290,112,20,{"$f":"((SUM(Z21:AS21))+0)+0","v":14235},694,734,808,695,701,751,851,962,1228,1166,1078,932,791,657,548,526,421,394,224,74]
[21,"CENTRAL",17,{"$f":"((SUM(E22:X22)))+0","v":364678},15187,18842,20774,19993,19066,18992,20105,23572,29617,32479,28888,26767,23448,19243,16663,13640,8342,6119,2415,526,{"$f":"((SUM(Z22:AS22))+0)+0","v":392617},14195,17922,19551,18853,17936,18826,20527,24291,30562,32396,30132,28077,26062,22815,20777,18019,12461,11371,5902,1942]
[22,"RIBERA BAJA DEL EBRO",18,{"$f":"((SUM(E23:X23)))+0","v":4355},144,183,191,206,197,239,234,284,287,312,333,357,342,308,234,204,128,114,50,8,{"$f":"((SUM(Z23:AS23))+0)+0","v":4162},134,172,183,169,191,199,206,238,274,261,304,321,318,285,218,197,192,181,86,33]
[23,"BAJO ARAGÓN-CASPE/BAIX ARAGÓ-CASP",19,{"$f":"((SUM(E24:X24)))+0","v":8179},332,402,410,412,490,490,468,569,689,699,645,551,494,428,357,290,214,159,64,16,{"$f":"((SUM(Z24:AS24))+0)+0","v":7149},325,357,352,364,358,329,382,438,507,543,474,462,460,395,416,318,242,246,138,43]
[24,"COMUNIDAD DE CALATAYUD",20,{"$f":"((SUM(E25:X25)))+0","v":18542},481,645,878,859,950,937,1153,1032,1299,1492,1666,1484,1310,1077,920,817,642,554,277,69,{"$f":"((SUM(Z25:AS25))+0)+0","v":17591},486,578,732,780,816,823,861,953,1174,1284,1427,1336,1243,956,995,977,771,786,467,146]
[25,"CAMPO DE CARIÑENA",21,{"$f":"((SUM(E26:X26)))+0","v":5298},153,179,210,207,275,281,336,333,419,450,505,443,400,306,253,206,141,115,75,11,{"$f":"((SUM(Z26:AS26))+0)+0","v":4748},157,209,236,216,202,253,252,265,316,336,360,356,350,286,213,225,196,170,116,34]
[26,"CAMPO DE BELCHITE",22,{"$f":"((SUM(E27:X27)))+0","v":2423},48,38,65,96,108,103,111,117,147,199,208,238,211,155,165,152,97,110,37,18,{"$f":"((SUM(Z27:AS27))+0)+0","v":2138},40,56,54,82,101,87,85,84,106,136,167,163,141,164,149,153,130,135,79,26]
[27,"BAJO MARTÍN",23,{"$f":"((SUM(E28:X28)))+0","v":3224},107,120,129,141,161,183,186,157,199,248,233,276,289,194,171,145,118,111,45,11,{"$f":"((SUM(Z28:AS28))+0)+0","v":3046},94,116,139,125,135,148,145,139,176,180,214,228,238,169,184,183,152,166,86,29]
[28,"CAMPO DE DAROCA",24,{"$f":"((SUM(E29:X29)))+0","v":2927},66,83,92,84,112,140,174,149,200,211,273,251,233,213,171,159,131,115,56,14,{"$f":"((SUM(Z29:AS29))+0)+0","v":2524},65,72,61,85,112,111,113,135,123,173,193,180,194,141,167,163,149,161,95,31]
[29,"JILOCA",25,{"$f":"((SUM(E30:X30)))+0","v":6480},221,240,303,260,298,321,350,374,467,464,500,557,497,373,369,290,235,218,118,25,{"$f":"((SUM(Z30:AS30))+0)+0","v":5910},215,227,261,253,313,292,340,309,357,379,436,422,367,330,300,315,264,295,181,54]
{"$rows_left_out":744}
{"sheet":"datosext","index":2,"n_rows":769,"n_cols":47,"rows_kept":769,"cut":false,"hidden":true,"merged":[]}
[null,"referencia geográfica","código","TOTAL VARONES","01- de 0 a 4","02- de 5 a 9","03- de 10 a 14","04- de 15 a 19","05- de 20 a 24","06- de 25 a 29","07- de 30 a 34","08- de 35 a 39","09- de 40 a 44","10- de 45 a 49","11- de 50 a 54","12- de 55 a 59","13- de 60 a 64","14- de 65 a 69","15- de 70 a 74","16- de 75 a 79","17- de 80 a 84","18- de 85 a 89","19- de 90 a 94","20- de 95 y más","TOTAL MUJERES","01- de 0 a 4","02- de 5 a 9","03- de 10 a 14","04- de 15 a 19","05- de 20 a 24","06- de 25 a 29","07- de 30 a 34","08- de 35 a 39","09- de 40 a 44","10- de 45 a 49","11- de 50 a 54","12- de 55 a 59","13- de 60 a 64","14- de 65 a 69","15- de 70 a 74","16- de 75 a 79","17- de 80 a 84","18- de 85 a 89","19- de 90 a 94","20- de 95 y más"]
[1,"ARAGÓN",2,{"$f":"((SUM(E2:X2)))+0","v":84233},4593,4757,4359,4526,6402,7658,8255,9137,10244,8860,6650,4016,2440,1278,558,270,152,61,15,2,80529,4335,4440,3950,3784,5586,7377,9119,9694,9420,7584,5999,3613,2442,1529,832,435,221,120,37,12]
[2,"PROVINCIA DE HUESCA",22,{"$f":"((SUM(E3:X3)))+0","v":15945},830,847,778,842,1188,1478,1555,1813,2067,1738,1246,716,404,225,112,68,22,12,3,1,{"$f":"(SUM(Z3:AS3))+0","v":13846},780,743,646,635,964,1248,1584,1705,1642,1298,1047,664,365,245,129,73,37,29,8,4]
[3,"PROVINCIA DE TERUEL",44,{"$f":"((SUM(E4:X4)))+0","v":8042},490,545,452,455,673,637,700,829,980,823,590,388,248,120,66,26,12,5,3,0,{"$f":"(SUM(Z4:AS4))+0","v":7562},505,536,415,394,530,658,803,773,835,693,576,295,245,147,73,33,35,12,3,1]
[4,"PROVINCIA DE ZARAGOZA",50,{"$f":"((SUM(E5:X5)))+0","v":60246},3273,3365,3129,3229,4541,5543,6000,6495,7197,6299,4814,2912,1788,933,380,176,118,44,9,1,{"$f":"(SUM(Z5:AS5))+0","v":59121},3050,3161,2889,2755,4092,5471,6732,7216,6943,5593,4376,2654,1832,1137,630,329,149,79,26,7]
[5,"LA JACETANIA",1,{"$f":"((SUM(E6:X6)))+0","v":582},18,20,29,31,39,57,58,69,67,62,44,38,21,9,12,5,1,2,0,0,{"$f":"(SUM(Z6:AS6))+0","v":699},22,28,28,34,63,66,81,69,95,53,57,42,20,10,16,7,5,1,0,2]
[6,"ALTO GÁLLEGO",2,{"$f":"((SUM(E7:X7)))+0","v":778},35,47,45,35,54,66,60,71,93,94,72,37,37,17,7,6,0,2,0,0,{"$f":"(SUM(Z7:AS7))+0","v":767},40,40,32,41,43,57,81,101,87,80,58,43,25,18,8,6,3,3,1,0]
[7,"SOBRARBE",3,{"$f":"((SUM(E8:X8)))+0","v":490},25,33,33,25,29,28,44,51,58,38,41,37,18,17,8,5,0,0,0,0,{"$f":"(SUM(Z8:AS8))+0","v":485},20,14,15,17,29,32,71,54,43,47,52,40,21,13,8,5,2,2,0,0]
[8,"LA RIBAGORZA",4,{"$f":"((SUM(E9:X9)))+0","v":838},45,41,32,26,59,75,89,92,102,96,67,44,26,19,12,8,5,0,0,0,{"$f":"(SUM(Z9:AS9))+0","v":835},30,37,35,32,56,80,81,100,108,87,73,48,31,18,9,6,2,1,1,0]
[9,"CINCO VILLAS",5,{"$f":"((SUM(E10:X10)))+0","v":2563},130,140,133,132,206,259,251,263,300,284,213,122,76,35,12,4,1,1,1,0,{"$f":"(SUM(Z10:AS10))+0","v":2021},140,131,131,116,127,196,213,230,219,161,141,93,65,29,16,6,5,2,0,0]
[10,"HOYA DE HUESCA/PLANA DE UESCA",6,{"$f":"((SUM(E11:X11)))+0","v":3402},175,220,185,223,264,331,343,381,397,312,236,133,92,62,21,17,3,4,2,1,{"$f":"(SUM(Z11:AS11))+0","v":3435},180,190,169,155,233,320,384,433,416,317,236,156,90,68,44,19,13,8,3,1]
[11,"SOMONTANO DE BARBASTRO",7,{"$f":"((SUM(E12:X12)))+0","v":1333},77,68,62,78,93,110,123,146,193,138,91,62,39,20,18,10,3,1,1,0,{"$f":"(SUM(Z12:AS12))+0","v":1296},56,52,55,48,92,129,168,163,147,111,87,73,41,34,18,9,5,7,0,1]
[12,"CINCA MEDIO",8,{"$f":"((SUM(E13:X13)))+0","v":2241},131,122,120,133,157,205,193,264,272,251,195,106,52,19,10,6,5,0,0,0,{"$f":"(SUM(Z13:AS13))+0","v":1824},111,118,90,87,130,197,204,203,207,181,133,82,34,24,10,7,4,2,0,0]
[13,"LA LITERA/LA LLITERA",9,{"$f":"((SUM(E14:X14)))+0","v":1945},84,80,73,105,158,216,202,211,291,237,144,79,29,15,14,3,3,1,0,0,{"$f":"(SUM(Z14:AS14))+0","v":1215},91,59,74,57,93,106,139,162,143,110,73,48,27,18,5,7,1,2,0,0]
[14,"LOS MONEGROS",10,{"$f":"((SUM(E15:X15)))+0","v":1240},71,59,61,64,84,128,148,129,168,133,95,37,28,22,5,4,2,2,0,0,{"$f":"(SUM(Z15:AS15))+0","v":1105},78,73,44,56,56,86,116,149,121,103,87,54,37,22,12,3,3,2,3,0]
[15,"BAJO CINCA/BAIX CINCA",11,{"$f":"((SUM(E16:X16)))+0","v":3399},180,175,153,139,258,291,328,425,463,411,293,163,70,34,7,6,2,1,0,0,{"$f":"(SUM(Z16:AS16))+0","v":2447},167,151,113,120,181,195,289,301,305,233,211,92,52,28,3,4,0,1,1,0]
[16,"TARAZONA Y EL  MONCAYO",12,{"$f":"((SUM(E17:X17)))+0","v":633},38,41,29,35,50,62,58,82,70,58,39,34,18,11,5,3,0,0,0,0,{"$f":"(SUM(Z17:AS17))+0","v":568},38,29,26,23,42,52,73,77,63,42,28,22,34,7,5,6,0,0,1,0]
[17,"CAMPO DE BORJA",13,{"$f":"((SUM(E18:X18)))+0","v":935},52,68,62,56,57,90,73,105,112,102,71,54,17,8,7,1,0,0,0,0,{"$f":"(SUM(Z18:AS18))+0","v":754},56,40,47,38,48,66,92,90,91,73,50,23,20,5,3,7,4,1,0,0]
[18,"ARANDA",14,{"$f":"((SUM(E19:X19)))+0","v":258},6,9,10,17,18,16,20,25,35,41,30,13,10,4,3,1,0,0,0,0,{"$f":"(SUM(Z19:AS19))+0","v":256},6,10,11,14,12,19,25,34,32,33,25,11,12,7,4,0,0,1,0,0]
[19,"RIBERA ALTA DEL EBRO",15,{"$f":"((SUM(E20:X20)))+0","v":1617},66,72,76,81,91,126,142,184,194,189,187,100,62,26,8,9,4,0,0,0,{"$f":"(SUM(Z20:AS20))+0","v":1554},56,97,81,68,101,129,173,182,170,159,129,85,49,35,16,16,4,3,1,0]
[20,"VALDEJALÓN",16,{"$f":"((SUM(E21:X21)))+0","v":3835},231,202,185,166,251,279,382,389,487,442,408,193,124,69,17,4,4,2,0,0,{"$f":"(SUM(Z21:AS21))+0","v":3140},216,176,148,126,189,253,336,374,400,322,289,131,83,50,23,11,8,3,2,0]
[21,"CENTRAL",17,{"$f":"((SUM(E22:X22)))+0","v":42635},2376,2385,2246,2337,3283,4051,4304,4661,5049,4346,3174,2033,1209,636,281,127,92,37,7,1,{"$f":"(SUM(Z22:AS22))+0","v":44259},2103,2276,2089,2014,3153,4229,5145,5491,5236,4149,3201,2007,1349,862,497,251,116,66,20,5]
[22,"RIBERA BAJA DEL EBRO",18,{"$f":"((SUM(E23:X23)))+0","v":405},16,23,25,16,39,36,35,51,45,36,26,24,18,6,4,2,3,0,0,0,{"$f":"(SUM(Z23:AS23))+0","v":409},39,37,21,20,22,34,35,60,45,40,17,10,6,11,4,6,1,1,0,0]
[23,"BAJO ARAGÓN-CASPE/BAIX ARAGÓ-CASP",19,{"$f":"((SUM(E24:X24)))+0","v":2508},139,151,117,141,233,229,247,243,290,236,199,124,87,43,16,8,3,1,1,0,{"$f":"(SUM(Z24:AS24))+0","v":1678},147,117,108,108,113,141,174,174,157,152,113,69,51,28,13,8,3,1,0,1]
[24,"COMUNIDAD DE CALATAYUD",20,{"$f":"((SUM(E25:X25)))+0","v":2741},118,156,139,152,182,213,236,285,353,316,256,133,107,57,21,10,5,2,0,0,{"$f":"(SUM(Z25:AS25))+0","v":2679},118,126,133,127,168,194,278,306,332,285,250,129,108,66,40,14,3,1,0,1]
[25,"CAMPO DE CARIÑENA",21,{"$f":"((SUM(E26:X26)))+0","v":1248},54,62,60,44,86,107,148,125,151,152,134,52,39,26,3,3,2,0,0,0,{"$f":"(SUM(Z26:AS26))+0","v":1009},75,61,68,60,60,86,102,111,110,100,76,43,33,16,3,3,1,0,1,0]
[26,"CAMPO DE BELCHITE",22,{"$f":"((SUM(E27:X27)))+0","v":169},7,13,12,18,16,11,11,16,22,20,12,2,5,1,1,1,1,0,0,0,{"$f":"(SUM(Z27:AS27))+0","v":191},13,18,4,11,18,12,21,25,23,19,9,8,4,4,2,0,0,0,0,0]
[27,"BAJO MARTÍN",23,{"$f":"((SUM(E28:X28)))+0","v":397},31,27,19,26,33,34,32,42,44,39,30,15,15,6,3,1,0,0,0,0,{"$f":"(SUM(Z28:AS28))+0","v":352},28,34,27,23,28,30,38,24,32,29,22,10,11,5,5,1,2,3,0,0]
[28,"CAMPO DE DAROCA",24,{"$f":"((SUM(E29:X29)))+0","v":396},29,25,20,17,22,35,60,40,52,43,33,8,8,2,0,1,1,0,0,0,{"$f":"(SUM(Z29:AS29))+0","v":341},28,24,13,18,27,40,35,32,35,34,28,9,5,9,0,1,3,0,0,0]
[29,"JILOCA",25,{"$f":"((SUM(E30:X30)))+0","v":937},69,57,71,57,78,75,93,89,104,106,66,35,20,8,6,1,2,0,0,0,{"$f":"(SUM(Z30:AS30))+0","v":871},57,70,55,49,74,76,96,83,104,65,63,33,23,13,7,0,2,0,1,0]
{"$rows_left_out":739}