{"text_format":"1","workbook":"xlsx","n_sheets":3,"sheets":["DIBUJAR","datos","datosext"],"not_rendered":{"charts":1,"images":3,"macros":0,"external_links":0,"defined_names":6,"comments":0,"pivot_tables":0},"unopened":[],"bounds":{"document_bytes":16777216,"sheet_cells":100000,"rows_first":2000,"rows_last":500,"rows_between":2000,"halvings":0,"cell_chars":16384,"cell_head_chars":4096},"cells_cut":0,"cells_raw":0,"read":"whole","date_system":"1900"}

{"sheet":"DIBUJAR","index":0,"n_rows":55,"n_cols":15,"rows_kept":55,"cut":false,"hidden":false,"merged":[]}
["Pirámides de población a 1 de enero de 2021",null,null,null,null,"(Revisión del Padrón Municipal de Habitantes a 1 de enero de 2007)"]
["Fuente: Padrón Municipal de Habitantes a 1 de enero de 2021",null,null,null,null,"Elaboración: Instituto Aragonés de Estadística"]
["Elaboración. Instituto Aragonés de Estadística."]
[]
["Elegir territorio"]
[null,null,{"$f":"VLOOKUP(F6,datos!A2:B769,2)","v":"ARAGÓN"},null,null,1,null,null,null,null,null,null,"extranjeros"]
[null,null,null,null,null,null,null,null,{"$f":"B6&\" \"&C6","v":" ARAGÓN"},null,null,null,{"$f":"B6&\" \"&C6","v":" ARAGÓN"}]
[null,"Total población"]
[null,"Edad","Ambos Sexos","Hombre","Mujer",null,null,"datos dibujo",{"$f":"D9","v":"Hombre"},{"$f":"E9","v":"Mujer"},"TOTALES","datos dibujo","Hombre","Mujer","TOTALES"]
[null,"0 a 4",{"$f":"D10+E10","v":51645},{"$f":"VLOOKUP($F$6,datos!$A$2:$AS$769,5)","v":26493},{"$f":"VLOOKUP($F$6,datos!$A$2:$AS$769,26)","v":25152},null,null,{"$f":"B10","v":"0 a 4"},{"$f":"-D10/$C$30","v":-1.9975706139289326E-2},{"$f":"E10/$C$30","v":1.8964592942113202E-2},{"$f":"J10-I10","v":3.8940299081402528E-2},{"$f":"B10","v":"0 a 4"},{"$f":"-D35/$C$30","v":-3.6124111317455613E-3},{"$f":"E35/C$30","v":3.3824413143415965E-3},{"$f":"-M10+N10","v":6.9948524460871579E-3}]
[null,"5 a 9",62165,{"$f":"VLOOKUP($F$6,datos!$A$2:$AS$769,6)","v":31868},{"$f":"VLOOKUP($F$6,datos!$A$2:$AS$769,27)","v":30297},null,null,"5 a 9",-2.4028452921408379E-2,2.2843919861927631E-2,4.687237278333601E-2,{"$f":"B11","v":"5 a 9"},{"$f":"-D36/$C$30","v":-3.4616112514806664E-3},{"$f":"E36/C$30","v":3.3062873748078243E-3},{"$f":"N11-M11","v":6.7678986262884912E-3}]
[null,"10 a 14",67267,{"$f":"VLOOKUP($F$6,datos!$A$2:$AS$769,7)","v":34714},{"$f":"VLOOKUP($F$6,datos!$A$2:$AS$769,28)","v":32553},null,null,"10 a 14",-2.6174335217577838E-2,2.4544942511315646E-2,5.071927772889348E-2,"10 a 14",-3.0876275484237265E-3,2.8553957328157882E-3,5.9430232812395147E-3]
[null,"15 a 19",64336,{"$f":"VLOOKUP($F$6,datos!$A$2:$AS$769,8)","v":33252},{"$f":"VLOOKUP($F$6,datos!$A$2:$AS$769,29)","v":31084},null,null,"15 a 19",-2.5071988092841453E-2,2.3437317390769992E-2,4.8509305483611445E-2,"15 a 19",-3.4495472610594747E-3,2.8244817573614845E-3,6.2740290184209596E-3]
[null,"20 a 24",64007,{"$f":"VLOOKUP($F$6,datos!$A$2:$AS$769,9)","v":33240},{"$f":"VLOOKUP($F$6,datos!$A$2:$AS$769,30)","v":30767},null,null,"20 a 24",-2.506294010002556E-2,2.3198299580550134E-2,4.826123968057569E-2,"20 a 24",-4.8007141882329346E-3,4.4003405061296382E-3,9.2010546943625728E-3]
[null,"25 a 29",66580,{"$f":"VLOOKUP($F$6,datos!$A$2:$AS$769,10)","v":33986},{"$f":"VLOOKUP($F$6,datos!$A$2:$AS$769,31)","v":32594},null,null,"25 a 29",-2.562542365341362E-2,2.4575856486769951E-2,5.0201280140183574E-2,"25 a 29",-5.6142795422620432E-3,5.7288874512633637E-3,1.1343166993525406E-2]
[null,"30 a 34",73318,{"$f":"VLOOKUP($F$6,datos!$A$2:$AS$769,11)","v":37402},{"$f":"VLOOKUP($F$6,datos!$A$2:$AS$769,32)","v":35916},null,null,"30 a 34",-2.8201085608338027E-2,2.7080642497969858E-2,5.5281728106307881E-2,"30 a 34",-6.4632828681534023E-3,7.061958392805036E-3,1.3525241260958439E-2]
[null,"35 a 39",85326,{"$f":"VLOOKUP($F$6,datos!$A$2:$AS$769,12)","v":43530},{"$f":"VLOOKUP($F$6,datos!$A$2:$AS$769,33)","v":41796},null,null,"35 a 39",-3.2821593939654413E-2,3.1514158977757771E-2,6.4335752917412184E-2,"35 a 39",-7.0152104299229185E-3,7.2497042437348301E-3,1.4264914673657748E-2]
[null,"40 a 44",105885,{"$f":"VLOOKUP($F$6,datos!$A$2:$AS$769,13)","v":54249},{"$f":"VLOOKUP($F$6,datos!$A$2:$AS$769,34)","v":51636},null,null,"40 a 44",-4.0903713522451465E-2,3.8933513086790612E-2,7.9837226609242085E-2,"40 a 44",-7.7556378420235534E-3,6.8613945520527254E-3,1.4617032394076279E-2]
[null,"45 a 49",108178,{"$f":"VLOOKUP($F$6,datos!$A$2:$AS$769,14)","v":55513},{"$f":"VLOOKUP($F$6,datos!$A$2:$AS$769,35)","v":52665},null,null,"45 a 49",-4.1856768765725597E-2,3.9709378470753495E-2,8.1566147236479092E-2,"45 a 49",-6.3773269364024122E-3,5.5079656266752925E-3,1.1885292563077705E-2]
[null,"50 a 54",102610,{"$f":"VLOOKUP($F$6,datos!$A$2:$AS$769,15)","v":52004},{"$f":"VLOOKUP($F$6,datos!$A$2:$AS$769,36)","v":50606},null,null,"50 a 54",-3.9210984866478019E-2,3.8156893703426398E-2,7.7367878569904416E-2,"50 a 54",-4.7230522498965134E-3,4.1620766953111036E-3,8.8851289452076161E-3]
[null,"55 a 59",97503,{"$f":"VLOOKUP($F$6,datos!$A$2:$AS$769,16)","v":49180},{"$f":"VLOOKUP($F$6,datos!$A$2:$AS$769,37)","v":48323},null,null,"55 a 59",-3.7081690557137698E-2,3.6435513070202624E-2,7.3517203627340322E-2,"55 a 59",-2.8086477699336707E-3,2.6058219309773867E-3,5.4144697009110574E-3]
[null,"60 a 64",87838,{"$f":"VLOOKUP($F$6,datos!$A$2:$AS$769,17)","v":43443},{"$f":"VLOOKUP($F$6,datos!$A$2:$AS$769,38)","v":44395},null,null,"60 a 64",-3.275599599173918E-2,3.3473803421800084E-2,6.6229799413539264E-2,"60 a 64",-1.682926663756229E-3,1.7643585990992723E-3,3.4472852628555013E-3]
[null,"65 a 69",72603,{"$f":"VLOOKUP($F$6,datos!$A$2:$AS$769,18)","v":34996},{"$f":"VLOOKUP($F$6,datos!$A$2:$AS$769,39)","v":37607},null,null,"65 a 69",-2.6386963048751339E-2,2.8355655485609546E-2,5.4742618534360882E-2,"65 a 69",-8.4975732529268377E-4,1.0925451325191648E-3,1.9423024578118487E-3]
[null,"70 a 74",65294,{"$f":"VLOOKUP($F$6,datos!$A$2:$AS$769,19)","v":30530},{"$f":"VLOOKUP($F$6,datos!$A$2:$AS$769,40)","v":34764},null,null,"70 a 74",-2.3019601722436233E-2,2.6212035187644062E-2,4.9231636910080298E-2,"70 a 74",-3.9207968868872718E-4,5.6248355338805859E-4,9.5456324207678577E-4]
[null,"75 a 79",54091,{"$f":"VLOOKUP($F$6,datos!$A$2:$AS$769,20)","v":24275},{"$f":"VLOOKUP($F$6,datos!$A$2:$AS$769,41)","v":29816},null,null,"75 a 79",-1.8303335467151641E-2,2.2481246149890558E-2,4.0784581617042195E-2,"75 a 79",-1.9453184554171465E-4,3.1290975154965725E-4,5.0744159709137187E-4]
[null,"80 a 84",40287,{"$f":"VLOOKUP($F$6,datos!$A$2:$AS$769,21)","v":16622},{"$f":"VLOOKUP($F$6,datos!$A$2:$AS$769,42)","v":23665},null,null,"80 a 84",-1.2532978048815429E-2,1.7843395832343709E-2,3.0376373881159137E-2,"80 a 84",-1.0480591678410207E-4,1.5456987727151744E-4,2.5937579405561949E-4]
[null,"85 a 89",35352,{"$f":"VLOOKUP($F$6,datos!$A$2:$AS$769,22)","v":13362},{"$f":"VLOOKUP($F$6,datos!$A$2:$AS$769,43)","v":21990},null,null,"85 a 89",-1.0074940000497639E-2,1.6580446835125214E-2,2.6655386835622852E-2,"85 a 89",-4.7501962283441947E-5,8.520193234966572E-5,1.3270389463310766E-4]
[null,"90 a 94",16876,{"$f":"VLOOKUP($F$6,datos!$A$2:$AS$769,23)","v":5339},{"$f":"VLOOKUP($F$6,datos!$A$2:$AS$769,44)","v":11537},null,null,"90 a 94",-4.0256028036713739E-3,8.6988910930804724E-3,1.2724493896751846E-2,"90 a 94",-9.8019922172181791E-6,2.7897977849005589E-5,3.7699970066223766E-5]
[null,"95 y más",5100,{"$f":"VLOOKUP($F$6,datos!$A$2:$AS$769,24)","v":1250},{"$f":"VLOOKUP($F$6,datos!$A$2:$AS$769,45)","v":3850},null,null,"95 y más",-9.4249925165559422E-4,2.9028976950992301E-3,3.8453969467548243E-3,"95 y más",-3.0159976052979016E-6,1.0555991618542654E-5,1.3571989223840557E-5]
[null,"Total general",{"$f":"SUM(C10:C29)","v":1326261},{"$f":"SUM(D10:D29)","v":655248},{"$f":"SUM(E10:E29)","v":671013},null,null,null,-0.4940565997190598,0.5059434002809402,1,null,{"$f":"-D55/$C$55","v":-0.51019716782979874},{"$f":"E55/C$55","v":0.48980283217020121},1]
[]
[]
[null,"Población extranjera"]
[null,"Edad","Ambos Sexos","Hombre","Mujer"]
[null,"0 a 4",{"$f":"D35+E35","v":9277},{"$f":"VLOOKUP($F$6,datosext!$A$2:$AS$769,5)","v":4791},{"$f":"VLOOKUP($F$6,datosext!$A$2:$AS$769,26)","v":4486}]
[null,"5 a 9",8976,{"$f":"VLOOKUP($F$6,datosext!$A$2:$AS$769,6)","v":4591},{"$f":"VLOOKUP($F$6,datosext!$A$2:$AS$769,27)","v":4385}]
[null,"10 a 14",7882,{"$f":"VLOOKUP($F$6,datosext!$A$2:$AS$769,7)","v":4095},{"$f":"VLOOKUP($F$6,datosext!$A$2:$AS$769,28)","v":3787}]
[null,"15 a 19",8321,{"$f":"VLOOKUP($F$6,datosext!$A$2:$AS$769,8)","v":4575},{"$f":"VLOOKUP($F$6,datosext!$A$2:$AS$769,29)","v":3746}]
[null,"20 a 24",12203,{"$f":"VLOOKUP($F$6,datosext!$A$2:$AS$769,9)","v":6367},{"$f":"VLOOKUP($F$6,datosext!$A$2:$AS$769,30)","v":5836}]
[null,"25 a 29",15044,{"$f":"VLOOKUP($F$6,datosext!$A$2:$AS$769,10)","v":7446},{"$f":"VLOOKUP($F$6,datosext!$A$2:$AS$769,31)","v":7598}]
{"$rows_left_out":16}
{"sheet":"datos","index":1,"n_rows":773,"n_cols":45,"rows_kept":773,"cut":false,"hidden":true,"merged":[]}
[null,"referencia geográfica","código","TOTAL VARONES","01- de 0 a 4","02- de 5 a 9","03- de 10 a 14","04- de 15 a 19","05- de 20 a 24","06- de 25 a 29","07- de 30 a 34","08- de 35 a 39","09- de 40 a 44","10- de 45 a 49","11- de 50 a 54","12- de 55 a 59","13- de 60 a 64","14- de 65 a 69","15- de 70 a 74","16- de 75 a 79","17- de 80 a 84","18- de 85 a 89","19- de 90 a 94","20- de 95 y más","TOTAL MUJERES","01- de 0 a 4","02- de 5 a 9","03- de 10 a 14","04- de 15 a 19","05- de 20 a 24","06- de 25 a 29","07- de 30 a 34","08- de 35 a 39","09- de 40 a 44","10- de 45 a 49","11- de 50 a 54","12- de 55 a 59","13- de 60 a 64","14- de 65 a 69","15- de 70 a 74","16- de 75 a 79","17- de 80 a 84","18- de 85 a 89","19- de 90 a 94","20- de 95 y más"]
[1,"ARAGÓN",2,{"$f":"SUM(D3:D5)","v":655248},{"$f":"SUM(E3:E5)","v":26493},31868,34714,33252,33240,33986,37402,43530,54249,55513,52004,49180,43443,34996,30530,24275,16622,13362,5339,1250,{"$f":"SUM(Y3:Y5)","v":671013},25152,30297,32553,31084,30767,32594,35916,41796,51636,52665,50606,48323,44395,37607,34764,29816,23665,21990,11537,3850]
[2,"PROVINCIA DE HUESCA",22,{"$f":"SUM(E3:X3)","v":113607},4474,5191,5664,5399,5748,5962,6450,7590,9516,9344,8893,8793,7754,6248,5454,4108,2993,2621,1135,270,{"$f":"(SUM(Z3:AS3))+0","v":110657},4177,5061,5323,5045,5166,5193,5884,6781,8349,8397,8252,8112,7450,6203,5503,4838,4018,3932,2203,770]
[3,"PROVINCIA DE TERUEL",44,{"$f":"SUM(E4:X4)","v":68287},2541,3055,3196,3171,3398,3471,3914,4378,5168,5234,5203,5535,5198,3940,3262,2580,2018,1919,903,203,66258,2479,2896,3138,2951,3135,3350,3607,3833,4452,4622,5024,5075,4460,3594,3268,2922,2684,2821,1476,471]
[4,"PROVINCIA DE ZARAGOZA",50,{"$f":"SUM(E5:X5)","v":473354},19478,23622,25854,24682,24094,24553,27038,31562,39565,40935,37908,34852,30491,24808,21814,17587,11611,8822,3301,777,494098,18496,22340,24092,23088,22466,24051,26425,31182,38835,39646,37330,35136,32485,27810,25993,22056,16963,15237,7858,2609]
[5,"LA JACETANIA",1,9199,306,374,459,378,494,467,556,626,786,784,750,726,704,523,401,314,248,195,86,22,9067,310,422,430,427,423,412,459,542,729,738,721,740,654,424,399,353,300,327,203,54]
[6,"ALTO GÁLLEGO",2,6989,263,276,317,318,308,339,383,495,603,604,611,580,545,390,295,223,170,181,80,8,6783,231,302,316,286,323,289,377,477,539,525,545,490,496,391,275,265,243,236,142,35]
[7,"SOBRARBE",3,4073,152,192,173,158,148,176,232,244,357,331,303,370,331,260,193,162,107,127,46,11,3584,129,143,163,123,150,175,225,255,295,288,280,295,220,222,163,126,125,125,64,18]
[8,"LA RIBAGORZA",4,6483,213,278,269,284,274,314,380,412,518,540,538,569,484,417,353,215,178,160,70,17,5984,188,225,263,251,254,295,307,404,482,472,488,459,402,331,302,246,208,230,134,43]
[9,"CINCO VILLAS",5,15802,532,589,732,700,807,792,897,993,1231,1276,1352,1400,1226,930,742,605,435,369,159,35,14991,545,569,639,701,728,760,810,836,1035,1057,1130,1187,1095,848,757,701,595,600,312,86]
[10,"HOYA DE HUESCA/PLANA DE UESCA",6,33682,1393,1719,1858,1738,1727,1744,1790,2194,2731,2792,2565,2528,2293,1848,1680,1232,785,684,305,76,35177,1367,1684,1778,1726,1584,1642,1780,2138,2698,2742,2591,2497,2405,2065,1826,1536,1113,1103,652,250]
[11,"SOMONTANO DE BARBASTRO",7,11889,492,519,555,575,586,614,683,800,958,909,896,889,810,679,648,459,325,310,143,39,12049,449,514,591,531,557,574,649,719,854,866,871,931,853,682,598,522,480,444,272,92]
[12,"CINCA MEDIO",8,12368,545,627,683,646,630,669,703,832,1017,1008,1005,978,750,602,556,408,322,263,98,26,11704,477,591,578,560,609,576,614,692,856,909,889,822,753,615,545,506,462,381,203,66]
[13,"LA LITERA/LA LLITERA",9,9850,347,407,525,510,580,573,510,620,865,809,773,726,586,504,455,383,285,260,103,29,8883,349,396,431,386,469,364,437,476,638,618,620,664,515,526,485,472,379,386,194,78]
[14,"LOS MONEGROS",10,9624,318,340,335,333,425,496,507,626,739,725,751,828,740,622,551,449,384,294,138,23,8845,248,294,326,332,341,404,499,478,572,612,616,705,623,540,546,516,428,441,238,86]
[15,"BAJO CINCA/BAIX CINCA",11,13046,553,596,625,608,763,740,882,947,1193,1117,1028,937,744,606,518,442,346,266,112,23,11958,513,622,567,576,590,611,723,774,889,885,898,763,751,607,568,510,437,423,182,69]
[16,"TARAZONA Y EL  MONCAYO",12,7007,234,308,369,351,376,364,378,425,528,568,556,551,484,382,351,307,233,167,61,14,6774,196,296,299,291,327,327,333,389,466,524,514,484,438,363,387,362,294,288,144,52]
[17,"CAMPO DE BORJA",13,7114,231,303,351,346,331,364,375,472,513,596,584,596,510,396,375,316,207,185,54,9,6607,240,231,317,297,329,275,337,381,490,473,492,498,464,339,397,329,277,261,132,48]
[18,"ARANDA",14,3257,56,73,133,151,157,143,150,178,217,271,316,310,253,232,169,177,135,97,29,10,3040,51,89,93,131,165,148,138,126,181,244,266,273,228,190,171,169,160,127,68,22]
[19,"RIBERA ALTA DEL EBRO",15,13928,539,679,821,671,626,732,843,980,1192,1242,1157,1029,958,758,571,433,322,259,92,24,13503,473,652,739,626,536,681,775,940,1213,1064,956,955,926,663,613,490,455,442,220,84]
[20,"VALDEJALÓN",16,15511,686,824,869,755,799,747,1004,1111,1484,1423,1338,1104,874,686,578,452,380,273,104,20,14186,698,766,769,679,677,770,901,1038,1198,1136,1042,918,769,638,553,503,431,412,215,73]
[21,"CENTRAL",17,365339,15851,19127,20659,19688,18764,18985,20758,24604,30998,31897,28679,26187,23119,18794,16758,13276,8296,6130,2236,533,393200,14937,18166,19510,18496,17842,19121,20988,25132,31530,32122,29722,27785,25747,22407,20737,17238,12855,11190,5752,1923]
[22,"RIBERA BAJA DEL EBRO",18,4327,142,185,184,209,198,221,238,289,302,294,330,358,342,286,226,197,145,123,46,12,4152,144,165,173,178,198,193,204,244,249,270,314,329,310,267,204,201,198,191,88,32]
[23,"BAJO ARAGÓN-CASPE/BAIX ARAGÓ-CASP",19,8130,333,414,372,409,448,488,479,605,722,724,625,528,448,424,352,296,218,168,60,17,7094,327,358,329,357,353,338,396,438,523,516,479,446,441,391,413,307,255,239,149,39]
[24,"COMUNIDAD DE CALATAYUD",20,18685,496,681,880,871,913,1020,1131,1065,1341,1495,1692,1470,1256,1028,925,844,682,572,263,60,17765,515,600,750,792,778,838,922,992,1175,1321,1431,1311,1182,931,1021,984,812,830,435,145]
[25,"CAMPO DE CARIÑENA",21,5309,156,186,191,211,272,278,330,374,422,456,495,461,367,308,241,204,143,138,64,12,4734,167,208,226,220,195,254,227,276,320,364,356,367,321,290,206,224,198,174,111,30]
[26,"CAMPO DE BELCHITE",22,2454,42,43,73,89,104,100,113,113,172,194,206,251,191,176,165,145,121,105,34,17,2142,46,52,58,85,96,84,79,91,112,136,173,156,152,140,154,158,133,139,70,28]
[27,"BAJO MARTÍN",23,3240,102,102,132,146,165,181,175,171,224,241,258,262,285,176,176,139,130,115,51,9,3063,96,126,126,127,130,161,135,136,176,191,221,239,207,175,190,180,162,177,87,21]
[28,"CAMPO DE DAROCA",24,2895,72,73,85,82,112,149,166,147,192,224,251,269,230,205,165,156,137,117,53,10,2533,73,56,70,82,108,113,129,125,140,161,188,173,190,143,176,176,143,180,81,26]
[29,"JILOCA",25,6432,222,254,291,252,266,300,359,379,468,491,501,540,490,353,362,287,246,237,115,19,5932,206,253,248,265,295,290,336,330,342,402,431,405,366,325,303,307,293,303,178,54]
[30,"CUENCAS MINERAS",26,4149,117,145,155,167,193,194,264,285,296,293,331,346,370,319,205,172,115,134,35,13,3691,133,139,149,153,151,203,236,187,232,218,252,331,256,224,209,156,160,193,86,23]
[31,"ANDORRA-SIERRA DE ARCOS",27,4943,162,187,211,218,242,248,284,322,369,335,383,443,470,328,217,182,126,129,74,13,4793,167,197,207,204,235,233,237,263,322,321,399,444,356,273,216,183,186,224,92,34]
[32,"BAJO ARAGÓN",28,14458,598,755,800,733,786,675,803,922,1127,1224,1095,1104,978,750,679,497,387,350,155,40,14252,618,707,779,726,657,686,787,838,1047,1018,1094,1016,900,737,705,565,509,500,269,94]
[33,"COMUNIDAD DE TERUEL",29,22602,947,1126,1123,1204,1182,1282,1270,1483,1776,1709,1712,1750,1633,1235,942,775,555,555,275,68,23638,895,1025,1162,1061,1214,1169,1285,1456,1688,1769,1810,1787,1592,1225,1083,990,865,906,495,161]
[34,"MAESTRAZGO",30,1723,50,74,68,60,73,79,104,110,118,127,134,147,138,115,99,69,60,62,30,6,1490,44,51,64,47,53,85,85,75,93,86,104,132,108,99,81,70,75,83,40,15]
[35,"SIERRA DE ALBARRACÍN",31,2394,41,64,72,70,95,112,155,149,166,195,186,249,206,149,138,99,103,86,53,6,1913,39,54,62,67,83,115,103,93,92,140,141,158,149,106,100,106,118,106,65,16]
[36,"GÚDAR-JAVALAMBRE",32,4074,144,170,179,151,198,208,252,299,311,306,318,356,303,219,192,149,133,124,52,10,3501,151,160,166,148,164,217,205,235,212,243,285,242,230,168,146,168,142,125,76,18]
[37,"MATARRAÑA/MATARRANYA",33,4272,158,178,165,170,198,192,248,258,313,313,285,338,325,296,252,211,163,127,63,19,3985,130,184,175,153,153,191,198,220,248,234,287,321,296,262,235,197,174,204,88,35]
[38,"22001 Abiego","22001",138,2,3,3,4,4,5,8,8,12,14,19,12,9,8,9,8,5,3,2,0,133,8,6,3,3,4,7,8,15,4,9,4,15,5,9,4,11,2,7,8,1]
[39,"22002 Abizanda","22002",73,1,3,2,0,1,1,4,7,6,5,8,11,4,2,3,7,5,3,0,0,70,1,4,3,1,4,3,6,6,4,3,8,2,7,4,6,3,3,2,0,0]
{"$rows_left_out":734}
{"sheet":"datosext","index":2,"n_rows":769,"n_cols":50,"rows_kept":769,"cut":false,"hidden":true,"merged":[]}
[null,"referencia geográfica","código","TOTAL VARONES","01- de 0 a 4","02- de 5 a 9","03- de 10 a 14","04- de 15 a 19","05- de 20 a 24","06- de 25 a 29","07- de 30 a 34","08- de 35 a 39","09- de 40 a 44","10- de 45 a 49","11- de 50 a 54","12- de 55 a 59","13- de 60 a 64","14- de 65 a 69","15- de 70 a 74","16- de 75 a 79","17- de 80 a 84","18- de 85 a 89","19- de 90 a 94","20- de 95 y más","TOTAL MUJERES","01- de 0 a 4","02- de 5 a 9","03- de 10 a 14","04- de 15 a 19","05- de 20 a 24","06- de 25 a 29","07- de 30 a 34","08- de 35 a 39","09- de 40 a 44","10- de 45 a 49","11- de 50 a 54","12- de 55 a 59","13- de 60 a 64","14- de 65 a 69","15- de 70 a 74","16- de 75 a 79","17- de 80 a 84","18- de 85 a 89","19- de 90 a 94","20- de 95 y más"]
[1,"ARAGÓN",2,{"$f":"(SUM(D3:D5))+0","v":82830},4791,4591,4095,4575,6367,7446,8572,9304,10286,8458,6264,3725,2232,1127,520,258,139,63,13,4,79519,4486,4385,3787,3746,5836,7598,9366,9615,9100,7305,5520,3456,2340,1449,746,415,205,113,37,14,null,null,null,null,0]
[2,"PROVINCIA DE HUESCA",22,{"$f":"(SUM(E3:X3))+0","v":15422},889,795,716,749,1219,1437,1603,1811,2010,1619,1156,640,385,193,100,61,22,10,6,1,{"$f":"(SUM(Z3:AS3))+0","v":13402},772,717,599,606,989,1235,1632,1672,1566,1242,944,590,348,232,110,68,36,29,9,6]
[3,"PROVINCIA DE TERUEL",44,7871,492,500,425,479,636,605,720,833,1007,818,532,373,236,100,67,31,9,5,3,0,7368,496,519,388,379,564,691,756,787,801,672,503,306,240,126,64,34,30,9,3,0]
[4,"PROVINCIA DE ZARAGOZA",50,59537,3410,3296,2954,3347,4512,5404,6249,6660,7269,6021,4576,2712,1611,834,353,166,108,48,4,3,58749,3218,3149,2800,2761,4283,5672,6978,7156,6733,5391,4073,2560,1752,1091,572,313,139,75,25,8]
[5,"LA JACETANIA",1,561,22,22,32,24,48,54,59,67,66,53,46,26,15,8,11,4,3,1,0,0,684,19,36,20,34,62,73,72,70,83,56,56,37,22,15,13,9,4,1,0,2]
[6,"ALTO GÁLLEGO",2,751,38,42,39,40,50,61,51,74,92,107,57,43,31,13,5,5,0,2,1,0,722,36,37,29,35,45,53,81,95,94,72,55,43,15,16,6,3,2,5,0,0]
[7,"SOBRARBE",3,484,26,35,29,23,25,32,55,47,59,39,37,35,21,11,4,5,0,0,1,0,490,25,10,17,13,29,43,72,59,41,57,41,40,17,9,8,4,3,2,0,0]
[8,"LA RIBAGORZA",4,847,44,43,27,26,59,76,97,88,113,87,69,49,28,20,10,7,4,0,0,0,830,35,34,40,34,48,87,86,102,102,86,68,37,31,21,10,4,3,1,1,0]
[9,"CINCO VILLAS",5,2422,141,136,130,129,174,231,233,252,308,251,205,115,74,27,11,2,1,2,0,0,1930,135,136,113,111,135,169,236,211,201,166,128,89,56,24,8,7,2,2,1,0]
[10,"HOYA DE HUESCA/PLANA DE UESCA",6,3353,207,212,171,203,277,313,357,394,363,327,207,126,95,51,24,15,5,3,2,1,3449,191,191,159,149,258,320,428,454,390,285,228,146,102,63,39,20,11,9,5,1]
[11,"SOMONTANO DE BARBASTRO",7,1227,82,63,49,66,86,98,121,149,186,111,90,42,36,22,10,10,3,1,2,0,1287,63,52,57,53,93,142,153,171,134,110,84,67,30,37,14,11,7,6,0,3]
[12,"CINCA MEDIO",8,2072,129,108,104,100,156,188,199,247,271,217,191,88,38,17,10,7,2,0,0,0,1645,111,97,71,87,136,159,192,179,189,178,113,62,34,17,12,4,3,1,0,0]
[13,"LA LITERA/LA LLITERA",9,1846,84,72,77,100,172,217,175,208,275,197,141,69,28,11,13,3,3,1,0,0,1151,88,63,64,59,94,95,153,146,134,102,60,42,20,18,3,6,1,3,0,0]
[14,"LOS MONEGROS",10,1138,75,62,53,43,84,118,129,126,151,119,79,42,30,16,4,3,2,2,0,0,1068,67,60,46,44,63,96,138,131,124,104,77,49,37,16,5,4,3,1,3,0]
[15,"BAJO CINCA/BAIX CINCA",11,3423,194,148,149,138,276,308,389,436,475,387,271,137,69,28,12,4,2,0,0,0,2340,148,155,104,112,170,188,299,292,309,211,185,80,52,27,4,3,0,0,1,0]
[16,"TARAZONA Y EL  MONCAYO",12,553,29,33,22,32,52,42,64,78,68,42,42,21,14,9,4,1,0,0,0,0,502,27,23,29,21,42,52,61,69,57,37,25,23,23,5,2,4,1,0,1,0]
[17,"CAMPO DE BORJA",13,908,60,68,64,50,55,70,78,104,111,108,62,48,14,9,5,2,0,0,0,0,755,54,47,40,37,52,73,91,95,98,70,41,21,18,4,4,6,4,0,0,0]
[18,"ARANDA",14,248,8,4,14,21,12,18,16,28,33,45,24,14,5,4,1,1,0,0,0,0,259,7,10,12,14,14,17,33,28,33,35,23,9,13,7,3,0,0,1,0,0]
[19,"RIBERA ALTA DEL EBRO",15,1519,68,66,74,74,92,120,140,170,181,187,157,96,54,24,9,5,2,0,0,0,1465,47,87,75,68,82,128,160,167,177,154,119,83,49,26,22,12,5,4,0,0]
[20,"VALDEJALÓN",16,3715,243,206,177,161,238,266,386,382,492,417,366,186,112,56,17,6,2,2,0,0,3127,208,194,136,124,200,268,367,396,362,319,252,128,84,47,25,5,7,3,2,0]
[21,"CENTRAL",17,42483,2455,2366,2122,2462,3337,3966,4542,4807,5103,4166,3068,1888,1097,579,264,120,94,41,3,3,44297,2303,2279,2058,2036,3318,4422,5331,5455,5110,3978,3017,1945,1302,853,445,247,110,63,19,6]
[22,"RIBERA BAJA DEL EBRO",18,389,20,28,22,20,32,39,31,49,38,36,19,24,17,5,5,3,1,0,0,0,375,36,33,20,19,29,33,29,59,41,26,15,9,8,8,5,4,1,0,0,0]
[23,"BAJO ARAGÓN-CASPE/BAIX ARAGÓ-CASP",19,2460,144,145,93,150,195,245,247,272,296,251,182,108,71,39,11,8,1,1,1,0,1586,143,108,90,105,123,142,176,158,148,134,114,56,40,27,9,9,2,1,0,1]
[24,"COMUNIDAD DE CALATAYUD",20,2803,137,144,145,166,196,235,263,292,364,292,259,129,96,51,18,11,4,1,0,0,2705,131,119,143,136,175,208,304,316,308,292,225,122,105,61,41,13,4,0,1,1]
[25,"CAMPO DE CARIÑENA",21,1234,63,58,46,42,86,99,149,147,158,142,123,55,38,21,3,2,1,1,0,0,990,72,59,61,56,58,84,90,121,109,111,62,53,32,14,2,4,1,1,0,0]
[26,"CAMPO DE BELCHITE",22,168,5,13,14,15,9,11,14,14,29,18,9,5,6,3,1,2,0,0,0,0,178,18,14,5,11,18,11,20,26,18,17,7,5,4,2,2,0,0,0,0,0]
[27,"BAJO MARTÍN",23,429,28,24,17,28,37,41,39,49,55,42,28,15,16,4,5,1,0,0,0,0,358,30,35,24,22,25,38,36,22,33,30,20,12,14,4,5,3,2,3,0,0]
[28,"CAMPO DE DAROCA",24,355,25,17,17,11,20,34,57,40,47,41,28,6,7,3,1,1,0,0,0,0,316,26,22,10,9,28,44,38,28,37,33,22,4,6,6,0,2,1,0,0,0]
[29,"JILOCA",25,852,74,55,62,50,59,61,78,90,96,108,54,31,20,7,3,2,2,0,0,0,838,59,77,45,51,76,80,87,88,86,72,45,30,24,11,4,0,2,0,1,0]
[30,"CUENCAS MINERAS",26,377,25,34,26,20,37,29,34,30,47,34,23,19,10,7,2,0,0,0,0,0,330,27,23,21,15,19,36,44,29,36,27,21,13,12,3,2,1,1,0,0,0]
[31,"ANDORRA-SIERRA DE ARCOS",27,433,28,30,26,33,35,23,40,41,61,42,23,28,13,4,3,2,1,0,0,0,433,26,28,29,23,39,33,51,45,46,40,28,20,11,7,3,1,2,1,0,0]
[32,"BAJO ARAGÓN",28,1917,112,128,120,105,154,142,172,204,251,220,136,81,44,28,9,5,2,3,1,0,1929,142,139,99,98,127,180,190,209,229,184,148,71,50,30,15,8,8,2,0,0]
[33,"COMUNIDAD DE TERUEL",29,2339,148,142,98,157,205,217,228,232,279,227,153,123,78,23,17,8,1,1,2,0,2264,132,128,108,126,209,217,227,246,248,212,164,85,79,43,18,7,11,3,1,0]
[34,"MAESTRAZGO",30,178,6,13,9,10,14,13,17,20,25,19,19,2,4,2,3,1,0,1,0,0,138,11,9,10,4,6,9,17,18,14,11,11,8,3,3,2,2,0,0,0,0]
[35,"SIERRA DE ALBARRACÍN",31,119,5,3,4,7,9,4,9,19,17,16,9,10,6,1,0,0,0,0,0,0,119,5,7,5,1,7,8,11,13,17,14,5,11,6,3,3,2,0,0,1,0]
[36,"GÚDAR-JAVALAMBRE",32,522,30,39,32,23,41,40,43,74,68,36,40,24,17,6,7,2,0,0,0,0,409,29,35,26,11,30,47,38,51,39,40,26,16,9,7,2,2,1,0,0,0]
[37,"MATARRAÑA/MATARRANYA",33,705,36,32,31,46,45,35,60,74,108,74,47,40,28,18,18,10,3,0,0,0,550,35,38,21,28,26,43,55,66,53,42,35,40,32,15,10,8,3,0,0,0]
[38,"22001 Abiego","22001",5,0,1,1,0,0,0,1,1,1,0,0,0,0,0,0,0,0,0,0,0,5,0,1,1,0,0,0,1,1,1,0,0,0,0,0,0,0,0,0,0,0,null,0]
[39,"22002 Abizanda","22002",12,0,0,0,0,0,0,2,2,1,1,1,3,0,0,0,2,0,0,0,0,12,0,0,0,0,0,0,2,2,1,1,1,3,0,0,0,2,0,0,0,0]
{"$rows_left_out":729}